{"text_format":"1","workbook":"xlsx","n_sheets":8,"sheets":["Notice","Prépa","Liste","Poules","GROUPE A","GROUPE B","Classement","F_Parties"],"not_rendered":{"charts":0,"images":3,"macros":1,"external_links":0,"defined_names":7,"comments":0,"pivot_tables":0},"unopened":[],"bounds":{"document_bytes":16777216,"sheet_cells":100000,"rows_first":2000,"rows_last":500,"rows_between":2000,"halvings":0,"cell_chars":16384,"cell_head_chars":4096},"cells_cut":0,"cells_raw":0,"read":"whole","date_system":"1900"}

{"sheet":"Notice","index":0,"n_rows":48,"n_cols":1,"rows_kept":48,"cut":false,"hidden":false,"merged":[]}
["MODE D'EMPLOI"]
[]
["Lisez bien les explications pour un emploi simplifié"]
[]
[]
["Préparation du tableau : Onglet \"Préparation\""]
["Renseignez les champs à l'aide de menus déroulants et saisissez directement le lieu ainsi que le nom du Juge-Arbitre dans les cellules prévues à cet effet. Le choix de la catégorie donnera la couleur appropriée au tableau. \nRemplissez les tableaux \"horaires et tables\" en fonction de votre POT"]
["Onglet \"Liste\""]
["C'est dans cet onglet que vous renseignerez le N° de dossard ainsi que toutes les informations concernants les joueurs(ses)"]
["Tri des joueurs : soit par classements soit par n° de dossards. ATTENTION : l'ordre des joueurs est important pour la composition des poules."]
["Onglet \"Poules\""]
["Pour autoriser la mise à blanc des poules, cliquez sur le bouton \" Débloquer\", vous pouvez ensuite faire la mise à blanc des poules à l'aide du bouton \"RAZ\"."]
["1ère possibilité : Aucune cellule en surbrillance, vos poules sont prêtes !!"]
["2ème possibilité : Plusieurs cellules en surbrillance, dans ce cas, apportez les modifications nécessaires en saisissant directement les N° de dossard sans oublier de respecter les règlements en vigueur."]
["Quand plus aucune cellule n'est en surbrillance, vos poules sont prêtes !!"]
[]
["Onglets \"GROUPE A, GROUPE B\""]
["La poule se remplie automatiquement. Il en est de même pour les fiches de parties."]
["Saisir les points de chaque manche. Exemple un manche gagnée par le premier joueur 13-11 sera noté 11"]
["Alors qu'une manche gagnée 12-14 par le second joueur sera noté -12"]
["La retranscription des victoires se fait alors automatiquement sur la poule."]
["ATTENTION : Pour noter \"-00\", il suffit de noter \"-0,01\" dans la cellule concernée"]
["Un joueur forfait pour sa partie doit être noté \"F\" dans la colonne \"A/F\"."]
["Ne pas noter de score dans les cases des manches de la partie concernée !"]
["Un joueur qui abandonne en cours de partie doit être noté \"A\" dans la colonne \"A/F\"."]
["Notez le score au moment de l'abandon dans la manche concernée et complétez si besoin par \"00 ou -00\" pour obtenir 3 manches gagnantes."]
["Lorsque tous les scores sont rentrés un classement des joueurs est fait. Les déparages sont à faire par le Juge-Arbitre. Pour obtenir le classement il suffit de noter la position de chaque joueur en bas de la poule, juste sous le total des points de chacun. \nLE TABLEAU CLASSEMENT SE REMPLI AUTOMATIQUEMENT DES QUE VOUS AUREZ RENSEIGNE LA POSITION DES JOUEURS"]
[]
["Pour faire la mise à blanc des scores, procédez de la même façon que pour l'onglet \"Poules\". Assurez vous que le bouton \"RAZ\" soit bien au rouge avant de commencer la saisie des résultats cela vous évitera peut être une mauvaise surprise …"]
["Pour imprimer les poules, un simple clic sur le bouton vert \"Feuille de poule\" dans le cadre \"IMPRIMER\" lancera l'impression,\nil en est de même pour les fiches de parties, cliquez sur le bouton vert \"Fiches de Parties\""]
[]
[]
["Onglet \"Classement\""]
["Le classement se fait automatiquement, vous n'avez rien à remplir sur cet onglet hormis les forfaits excusés ou non. Saisir uniquement le N° de dossard."]
["Une fois remplies toutes les informations nécessaires, vous êtes prêt à remonter les résultats à qui de droit"]
[]
["ATTENTION : Vous n'avez rien à faire sur l'onglet fiche \"F_Parties\" qui contient toutes les fiches de parties"]
[]
["Protection :"]
["Une protection est faite pour éviter la perte des données. "]
["Il n'y a pas lieu de déprotéger ces feuilles sauf la perte de données à vos risques exclusifs."]
[]
[]
["Ce logiciel est mis gracieusement à votre disposition alors respectez en les règles d'utilisation pour votre confort."]
["Ne pas supprimer de lignes sinon risque de pertes de données."]
[]
["Pour le renvoi des résultats :"]
["Pensez à conserver le fichier dans le format auquel il vous a été envoyé, cela nous permet de récupérer les informations en direct et retournez nous le fichier complété."]

{"sheet":"Prépa","index":1,"n_rows":110,"n_cols":31,"rows_kept":110,"cut":false,"hidden":false,"merged":[[3,18,3,23],[13,20,13,21],[5,20,5,21],[35,20,35,21],[36,18,36,19],[22,20,22,21],[15,18,15,19],[15,20,15,21],[49,20,49,21],[42,20,42,21],[43,18,43,19],[43,20,43,21],[45,18,45,23],[47,18,47,19],[47,20,47,21],[48,18,48,19],[46,20,46,21],[41,18,41,19],[41,20,41,21],[39,20,39,21],[36,20,36,21],[42,18,42,19],[34,20,34,21],[40,18,40,19],[5,18,5,19],[27,18,27,19],[28,18,28,19],[17,18,17,23],[18,20,18,21],[20,18,20,19],[21,18,21,19],[22,18,22,19],[49,18,49,19],[48,20,48,21],[40,20,40,21],[38,18,38,23],[31,18,31,23],[32,20,32,21],[33,18,33,19],[33,20,33,21],[34,18,34,19],[109,10,109,12],[78,10,78,12],[94,10,94,12],[107,10,107,12],[25,20,25,21],[27,14,27,16],[28,14,28,16],[35,18,35,19],[50,14,50,16],[70,14,70,16],[26,20,26,21],[28,20,28,21],[27,20,27,21],[50,18,50,19],[50,20,50,21],[0,10,1,16],[28,3,28,7],[27,3,27,4],[11,10,11,12],[23,3,23,7],[9,14,9,16],[13,3,13,6],[21,1,21,8],[19,5,19,7],[6,3,7,7],[24,3,24,7],[25,3,25,7],[3,25,3,30],[4,27,4,28],[5,25,5,26],[5,27,5,28],[6,25,6,26],[13,18,13,19],[10,18,10,23],[15,1,15,8],[49,14,49,16],[32,4,32,7],[26,3,26,7],[29,18,29,19],[29,20,29,21],[26,18,26,19],[19,18,19,19],[11,20,11,21],[6,18,6,19],[6,20,6,21],[7,18,7,19],[12,18,12,19],[12,20,12,21],[30,1,30,8],[24,18,24,23],[4,20,4,21],[6,27,6,28],[7,25,7,26],[7,27,7,28],[8,25,8,26],[8,27,8,28],[10,25,10,30],[71,14,71,16],[78,14,78,16],[91,14,91,16],[30,14,30,16],[31,14,31,16],[20,20,20,21],[21,20,21,21],[7,20,7,21],[8,18,8,19],[19,20,19,21],[8,20,8,21],[14,18,14,19],[14,20,14,21],[15,25,15,26],[15,27,15,28],[17,25,17,30],[18,27,18,28],[19,25,19,26],[19,27,19,28],[11,27,11,28],[12,25,12,26],[12,27,12,28],[13,25,13,26],[13,27,13,28],[14,25,14,26],[14,27,14,28],[24,25,24,30],[25,27,25,28],[26,25,26,26],[26,27,26,28],[27,25,27,26],[27,27,27,28],[20,25,20,26],[20,27,20,28],[21,25,21,26],[21,27,21,28],[22,25,22,26],[22,27,22,28],[33,27,33,28],[34,25,34,26],[34,27,34,28],[35,25,35,26],[35,27,35,28],[28,25,28,26],[28,27,28,28],[29,25,29,26],[29,27,29,28],[31,25,31,30],[32,27,32,28],[49,25,49,26],[49,27,49,28],[50,25,50,26],[50,27,50,28],[0,18,1,30],[45,25,45,30],[46,27,46,28],[47,25,47,26],[47,27,47,28],[48,25,48,26],[48,27,48,28],[41,25,41,26],[41,27,41,28],[42,25,42,26],[42,27,42,28],[43,25,43,26],[43,27,43,28],[36,25,36,26],[36,27,36,28],[38,25,38,30],[39,27,39,28],[40,25,40,26],[40,27,40,28],[33,25,33,26]]}
[null,null,"FEDERATION FRANCAISE",null,null,null,null,null,null,null,"Listes Deroulantes",null,null,null,null,null,null,null,"Gestion Horaires et Tables"]
[null,null,"HANDISPORT"]
[null,null,null,null,null,null,null,null,null,null,1," ",null,null,1," "]
[null,null,null,null,null,null,null,null,null,null,2,"Lundi",3,null,2,"Championnat de France",5,null,"GROUPE A - TOUR 1",null,null,null,null,null,null,"GROUPE b - TOUR 1"]
[null,null,null,null,null,null,null,null,null,null,3,"Mardi",null,null,3,"Championnat de France Jeunes",null,null,null,null,"Dates",null,"Heure","Table",null,null,null,"Dates",null,"Heure","Table"]
[null,null,null,null,null,null,null,null,null,null,4,"Mercredi",null,null,4,"Championnat de France Vétérans",null,null,"1 - 8",null,"2017-11-11",null,"9h30",1,null,"1 - 8",null,"2017-11-11",null,"9h30",5]
[null,null,null,"Préparation de la Compétition",null,null,null,null,null,null,5,"Jeudi",null,null,5,"Critérium Fédéral",null,null,"2 - 7",null,{"$f":"IF(U6<>\"\",U6,\"\")","v":"2017-11-11"},null,{"$f":"W6","v":"9h30"},2,null,"2 - 7",null,{"$f":"IF(AB6<>\"\",AB6,\"\")","v":"2017-11-11"},null,{"$f":"AD6","v":"9h30"},6]
[null,null,null,null,null,null,null,null,null,null,6,"Vendredi",null,null,6,"Tournoi",null,null,"3 - 6",null,{"$f":"IF(U6<>\"\",U6,\"\")","v":"2017-11-11"},null,{"$f":"W6","v":"9h30"},3,null,"3 - 6",null,{"$f":"IF(AB6<>\"\",AB6,\"\")","v":"2017-11-11"},null,{"$f":"AD6","v":"9h30"},7]
[null,null,null,null,null,null,null,null,null,null,7,"Samedi",null,null,null,null,null,null,"4 - 5",null,{"$f":"IF(U6<>\"\",U6,\"\")","v":"2017-11-11"},null,{"$f":"W6","v":"9h30"},4,null,"4 - 5",null,{"$f":"IF(AB6<>\"\",AB6,\"\")","v":"2017-11-11"},null,{"$f":"AD6","v":"9h30"},8]
[null,"Compétition :",null,null,null,null,"Saison :",null,null,null,8,"Dimanche",null,null,{"$f":"VLOOKUP(Q4,O3:P9,2,FALSE)","v":"Critérium Fédéral"}]
[null,null,null,null,null,null,null,null,null,null,null,null,null,null,null,null,null,null,"GROUPE A - TOUR 2",null,null,null,null,null,null,"GROUPE B - TOUR 2"]
[null,null,"Date :",null,null,null,null,null,null,null,{"$f":"VLOOKUP(M4,K3:L11,2,FALSE)","v":"Mardi"},null,null,null,1,null,null,null,null,null,"Dates",null,"Heure","Table",null,null,null,"Dates",null,"Heure","Table"]
[null,null,null,null,null,null,null,null,null,null,null,null,null,null,2,"Nat 1A",4,null,"1 - 7",null,"2017-11-11",null,"10h30",5,null,"1 - 7",null,"2017-11-11",null,"10h30",1]
[null,null,"Lieu :","TOURS",null,null,null,null,null,null,1," ",null,null,3,"Nat 1B",6,null,"6 - 8",null,{"$f":"IF(U13<>\"\",U13,\"\")","v":"2017-11-11"},null,{"$f":"W13","v":"10h30"},6,null,"6 - 8",null,{"$f":"IF(AB13<>\"\",AB13,\"\")","v":"2017-11-11"},null,{"$f":"AD13","v":"10h30"},2]
[null,null,null,null,null,null,null,null,null,null,2,"1er",11,null,4,"Nat 2A Nord",null,null,"2 - 5",null,{"$f":"IF(U13<>\"\",U13,\"\")","v":"2017-11-11"},null,{"$f":"W13","v":"10h30"},7,null,"2 - 5",null,{"$f":"IF(AB13<>\"\",AB13,\"\")","v":"2017-11-11"},null,{"$f":"AD13","v":"10h30"},3]
[null,null,null,null,null,null,null,null,null,null,3,2,null,null,5,"Nat 2A Sud",null,null,"3 - 4",null,{"$f":"IF(U13<>\"\",U13,\"\")","v":"2017-11-11"},null,{"$f":"W13","v":"10h30"},8,null,"3 - 4",null,{"$f":"IF(AB13<>\"\",AB13,\"\")","v":"2017-11-11"},null,{"$f":"AD13","v":"10h30"},4]
[null,null,null,null,null,null,null,null,null,null,4,3,null,null,6,"Nat 2B Nord"]
[null,"Groupe A :",null,null,null,"Groupe B : ",null,null,null,null,5,4,null,null,7,"Nat 2B Sud",null,null,"GROUPE A - TOUR 3",null,null,null,null,null,null,"GROUPE B - TOUR 3"]
[null,null,null,null,null,null,null,null,null,null,6,5,null,null,8,"Nat 3A Nord-Ouest",null,null,null,null,"Dates",null,"Heure","Table",null,null,null,"Dates",null,"Heure","Table"]
[null,null,null,"Tableau :",null,null,null,null,null,null,7,6,null,null,9,"Nat 3A Nord-Est",null,null,"1 - 6",null,"2017-11-11",null,"11h30",2,null,"1 - 6",null,"2017-11-11",null,"11h30",6]
[null,null,null,null,null,null,null,null,null,null,8,7,null,null,10,"Nat 3A Sud-Est",null,null,"5 - 7",null,{"$f":"IF(U20<>\"\",U20,\"\")","v":"2017-11-11"},null,{"$f":"W20","v":"11h30"},3,null,"5 - 7",null,{"$f":"IF(AB20<>\"\",AB20,\"\")","v":"2017-11-11"},null,{"$f":"AD20","v":"11h30"},7]
[null,null,null,null,null,null,null,null,null,null,9,8,null,null,11,"Nat 3A Sud-Ouest",null,null,"4 - 8",null,{"$f":"IF(U20<>\"\",U20,\"\")","v":"2017-11-11"},null,{"$f":"W20","v":"11h30"},4,null,"4 - 8",null,{"$f":"IF(AB20<>\"\",AB20,\"\")","v":"2017-11-11"},null,{"$f":"AD20","v":"11h30"},8]
[null,null,null,null,null,null,null,null,null,null,10,9,null,null,12,"Nat 3B Nord-Ouest",null,null,"2 - 3",null,{"$f":"IF(U20<>\"\",U20,\"\")","v":"2017-11-11"},null,{"$f":"W20","v":"11h30"},1,null,"2 - 3",null,{"$f":"IF(AB20<>\"\",AB20,\"\")","v":"2017-11-11"},null,{"$f":"AD20","v":"11h30"},5]
[null,null,"Organisateur :","4S Tours TT",null,null,null,null,null,null,11,10,null,null,13,"Nat 3B Nord-Est"]
[null,null,"Adresse :",null,null,null,null,null,null,null,12,11,null,null,14,"Nat 3B Sud-Est",null,null,"GROUPE A - TOUR 4",null,null,null,null,null,null,"GROUPE B - TOUR 4"]
[null,null,null,null,null,null,null,null,null,null,13,12,null,null,15,"Nat 3B Sud-Ouest",null,null,null,null,"Dates",null,"Heure","Table",null,null,null,"Dates",null,"Heure","Table"]
[null,null,null,null,null,null,null,null,null,null,14,13,null,null,null,null,null,null,"1 - 5",null,"2017-11-11",null,"13h30",6,null,"1 - 5",null,"2017-11-11",null,"13h30",2]
[null,null,"(",null,null,null,null,null,null,null,15,14,null,null,{"$f":"VLOOKUP(Q13,O12:P27,2,FALSE)","v":"Nat 2A Nord"},null,null,null,"4 - 6",null,{"$f":"IF(U27<>\"\",U27,\"\")","v":"2017-11-11"},null,{"$f":"W27","v":"13h30"},7,null,"4 - 6",null,{"$f":"IF(AB27<>\"\",AB27,\"\")","v":"2017-11-11"},null,{"$f":"AD27","v":"13h30"},3]
[null,null,"E-Mail :",null,null,null,null,null,null,null,16,15,null,null,{"$f":"IF(O28<>0,O28,\"\")","v":"Nat 2A Nord"},null,null,null,"3 - 7",null,{"$f":"IF(U27<>\"\",U27,\"\")","v":"2017-11-11"},null,{"$f":"W27","v":"13h30"},8,null,"3 - 7",null,{"$f":"IF(AB27<>\"\",AB27,\"\")","v":"2017-11-11"},null,{"$f":"AD27","v":"13h30"},4]
[null,null,null,null,null,null,null,null,null,null,17,16,null,null,null,null,null,null,"2 - 8",null,{"$f":"IF(U27<>\"\",U27,\"\")","v":"2017-11-11"},null,{"$f":"W27","v":"13h30"},5,null,"2 - 8",null,{"$f":"IF(AB27<>\"\",AB27,\"\")","v":"2017-11-11"},null,{"$f":"AD27","v":"13h30"},1]
[null,null,null,null,null,null,null,null,null,null,18,17,null,null,{"$f":"VLOOKUP(Q14,O12:P27,2,FALSE)","v":"Nat 2B Nord"}]
[null,null,null,null,null,null,null,null,null,null,19,18,null,null,{"$f":"IF(O31<>0,O31,\"\")","v":"Nat 2B Nord"},null,null,null,"GROUPE A - TOUR 5",null,null,null,null,null,null,"GROUPE B - TOUR 5"]
[null,null,null,"Juge Arbitre :","Nico Angenon",null,null,null,null,null,20,19,null,null,null,null,null,null,null,null,"Dates",null,"Heure","Table",null,null,null,"Dates",null,"Heure","Table"]
[null,null,null,null,null,null,null,null,null,null,21,20,null,null,null,null,null,null,"1 - 4",null,"2017-11-11",null,"14h30",3,null,"1 - 4",null,"2017-11-11",null,"14h30",7]
[null,null,null,null,null,null,null,null,null,null,22,21,null,null,null,null,null,null,"3 - 5",null,{"$f":"IF(U34<>\"\",U34,\"\")","v":"2017-11-11"},null,{"$f":"W34","v":"14h30"},4,null,"3 - 5",null,{"$f":"IF(AB34<>\"\",AB34,\"\")","v":"2017-11-11"},null,{"$f":"AD34","v":"14h30"},8]
[null,null,null,null,null,null,null,null,null,null,23,22,null,null,null,null,null,null,"2 - 6",null,{"$f":"IF(U34<>\"\",U34,\"\")","v":"2017-11-11"},null,{"$f":"W34","v":"14h30"},1,null,"2 - 6",null,{"$f":"IF(AB34<>\"\",AB34,\"\")","v":"2017-11-11"},null,{"$f":"AD34","v":"14h30"},5]
[null,null,null,null,null,null,null,null,null,null,24,23,null,null,1,null,null,null,"7 - 8",null,{"$f":"IF(U34<>\"\",U34,\"\")","v":"2017-11-11"},null,{"$f":"W34","v":"14h30"},2,null,"7 - 8",null,{"$f":"IF(AB34<>\"\",AB34,\"\")","v":"2017-11-11"},null,{"$f":"AD34","v":"14h30"},6]
[null,null,null,null,null,null,null,null,null,null,25,24,null,null,2,"Ile de France",5]
[null,null,null,null,null,null,null,null,null,null,26,25,null,null,3,"Hauts de France",null,null,"GROUPE A - TOUR 6",null,null,null,null,null,null,"GROUPE B - TOUR 6"]
[null,null,null,null,null,null,null,null,null,null,27,26,null,null,4,"Grand-Est",null,null,null,null,"Dates",null,"Heure","Table",null,null,null,"Dates",null,"Heure","Table"]
[null,null,null,null,null,null,null,null,null,null,28,27,null,null,5,"Bourgogne - Franche-Comté",null,null,"1 - 3",null,"2017-11-11",null,"15h30",7,null,"1 - 3",null,"2017-11-11",null,"15h30",3]
[null,null,null,null,null,null,null,null,null,null,29,28,null,null,6,"Bretagne",null,null,"2 - 4",null,{"$f":"IF(U41<>\"\",U41,\"\")","v":"2017-11-11"},null,{"$f":"W41","v":"15h30"},8,null,"2 - 4",null,{"$f":"IF(AB41<>\"\",AB41,\"\")","v":"2017-11-11"},null,{"$f":"AD41","v":"15h30"},4]
[null,null,null,null,null,null,null,null,null,null,30,29,null,null,7,"Pays de Loire",null,null,"5 - 8",null,{"$f":"IF(U41<>\"\",U41,\"\")","v":"2017-11-11"},null,{"$f":"W41","v":"15h30"},5,null,"5 - 8",null,{"$f":"IF(AB41<>\"\",AB41,\"\")","v":"2017-11-11"},null,{"$f":"AD41","v":"15h30"},1]
[null,null,null,null,null,null,null,null,null,null,31,30,null,null,8,"Normandie",null,null,"6 - 7",null,{"$f":"IF(U41<>\"\",U41,\"\")","v":"2017-11-11"},null,{"$f":"W41","v":"15h30"},6,null,"6 - 7",null,{"$f":"IF(AB41<>\"\",AB41,\"\")","v":"2017-11-11"},null,{"$f":"AD41","v":"15h30"},2]
[null,null,null,null,null,null,null,null,null,null,32,31,null,null,9,"Centre"]
[null,null,null,null,null,null,null,null,null,null,33,"1 et 2",null,null,10,"Auvergne - Rhône-Alpes",null,null,"GROUPE A - TOUR 7",null,null,null,null,null,null,"GROUPE B - TOUR 7"]
[null,null,null,null,null,null,null,null,null,null,34,"2 et 3",null,null,11,"PACA",null,null,null,null,"Dates",null,"Heure","Table",null,null,null,"Dates",null,"Heure","Table"]
[null,null,null,null,null,null,null,null,null,null,35,"3 et 4",null,null,12,"Occitanie",null,null,"1 - 2",null,"2017-11-11",null,"16h30",1,null,"1 - 2",null,"2017-11-11",null,"16h30",8]
[null,null,null,null,null,null,null,null,null,null,36,"4 et 5",null,null,13,"Nouvelle-Aquitaine",null,null,"3 - 8",null,{"$f":"IF(U48<>\"\",U48,\"\")","v":"2017-11-11"},null,{"$f":"W48","v":"16h30"},2,null,"3 - 8",null,{"$f":"IF(AB48<>\"\",AB48,\"\")","v":"2017-11-11"},null,{"$f":"AD48","v":"16h30"},7]
[null,null,null,null,null,null,null,null,null,null,37,"5 et 6",null,null,{"$f":"VLOOKUP(Q38,O37:P49,2,FALSE)","v":"Bourgogne - Franche-Comté"},null,null,null,"4 - 7",null,{"$f":"IF(U48<>\"\",U48,\"\")","v":"2017-11-11"},null,{"$f":"W48","v":"16h30"},3,null,"4 - 7",null,{"$f":"IF(AB48<>\"\",AB48,\"\")","v":"2017-11-11"},null,{"$f":"AD48","v":"16h30"},6]
[null,null,null,null,null,null,null,null,null,null,38,"6 et 7",null,null,{"$f":"O50","v":"Bourgogne - Franche-Comté"},null,null,null,"5 - 6",null,{"$f":"IF(U48<>\"\",U48,\"\")","v":"2017-11-11"},null,{"$f":"W48","v":"16h30"},4,null,"5 - 6",null,{"$f":"IF(AB48<>\"\",AB48,\"\")","v":"2017-11-11"},null,{"$f":"AD48","v":"16h30"},5]
[null,null,null,null,null,null,null,null,null,null,39,"7 et 8",null,null,null,null,null,null,null,"Seules les cases jaunes sont à modifier suivant vos horaires"]
[null,null,null,null,null,null,null,null,null,null,40,"8 et 9"]
[null,null,null,null,null,null,null,null,null,null,41,"9 et 10",null,null,1,null,null,null,null,"Idem pour la numérotation des tables "]
[null,null,null,null,null,null,null,null,null,null,42,"10 et 11",null,null,2,"OPEN Debout",3]
[null,null,null,null,null,null,null,null,null,null,43,"11 et 12",null,null,3,"OPEN Assis"]
[null,null,null,null,null,null,null,null,null,null,44,"12 et 13"]
[null,null,null,null,null,null,null,null,null,null,45,"13 et 14"]
[null,null,null,null,null,null,null,null,null,null,46,"14 et 15"]
[null,null,null,null,null,null,null,null,null,null,47,"15 et 16"]
[null,null,null,null,null,null,null,null,null,null,48,"16 et 17"]
[null,null,null,null,null,null,null,null,null,null,49,"17 et 18"]
[null,null,null,null,null,null,null,null,null,null,50,"18 et 19"]
[null,null,null,null,null,null,null,null,null,null,51,"19 et 20"]
[null,null,null,null,null,null,null,null,null,null,52,"20 et 21"]
[null,null,null,null,null,null,null,null,null,null,53,"21 et 22"]
[null,null,null,null,null,null,null,null,null,null,54,"22 et 23"]
[null,null,null,null,null,null,null,null,null,null,55,"23 et 24"]
[null,null,null,null,null,null,null,null,null,null,56,"24 et 25"]
[null,null,null,null,null,null,null,null,null,null,57,"25 et 26"]
[null,null,null,null,null,null,null,null,null,null,58,"26 et 27",null,null,{"$f":"VLOOKUP(Q55,O54:P70,2,FALSE)","v":"OPEN Assis"}]
[null,null,null,null,null,null,null,null,null,null,59,"27 et 28",null,null,{"$f":"IF(O71<>0,O71,\"\")","v":"OPEN Assis"}]
[null,null,null,null,null,null,null,null,null,null,60,"28 et 29"]
[null,null,null,null,null,null,null,null,null,null,61,"29 et 30",null,null,1," "]
[null,null,null,null,null,null,null,null,null,null,62,"30 et 1er",null,null,2,"1er Tour",3]
[null,null,null,null,null,null,null,null,null,null,63,"30 et 31",null,null,3,"2ème Tour"]
[null,null,null,null,null,null,null,null,null,null,64,"31 et 1er",null,null,4,"3ème Tour"]
[null,null,null,null,null,null,null,null,null,null,null,null,null,null,5,"4ème Tour"]
[null,null,null,null,null,null,null,null,null,null,{"$f":"VLOOKUP(M15,K14:L77,2,FALSE)","v":10},null,null,null,{"$f":"VLOOKUP(Q75,O74:P79,2,FALSE)","v":"2ème Tour"}]
[]
[null,null,null,null,null,null,null,null,null,null,1," ",null,null,1," "]
[null,null,null,null,null,null,null,null,null,null,2,"Janvier",3,null,2,"2015 - 2016",4]
[null,null,null,null,null,null,null,null,null,null,3,"Fevrier",null,null,3,"2016 - 2017"]
[null,null,null,null,null,null,null,null,null,null,4,"Mars",null,null,4,"2017 - 2018"]
[null,null,null,null,null,null,null,null,null,null,5,"Avril",null,null,5,"2018 - 2019"]
[null,null,null,null,null,null,null,null,null,null,6,"Mai",null,null,6,"2019 - 2020"]
[null,null,null,null,null,null,null,null,null,null,7,"Juin",null,null,7,"2020 - 2021"]
[null,null,null,null,null,null,null,null,null,null,8,"Juillet",null,null,8,"2021 - 2022"]
[null,null,null,null,null,null,null,null,null,null,9,"Août",null,null,9,"2022 - 2023"]
[null,null,null,null,null,null,null,null,null,null,10,"Septembre",null,null,10,"2023 - 2024"]
[null,null,null,null,null,null,null,null,null,null,11,"Octobre"]
[null,null,null,null,null,null,null,null,null,null,12,"Novembre",null,null,{"$f":"VLOOKUP(Q82,O81:P89,2,FALSE)","v":"2017 - 2018"}]
[null,null,null,null,null,null,null,null,null,null,13,"Décembre"]
[]
[null,null,null,null,null,null,null,null,null,null,{"$f":"VLOOKUP(M82,K81:L93,2,FALSE)","v":"Fevrier"}]
[]
[null,null,null,null,null,null,null,null,null,null,1," "]
[null,null,null,null,null,null,null,null,null,null,2,2015,5]
[null,null,null,null,null,null,null,null,null,null,3,2016]
[null,null,null,null,null,null,null,null,null,null,4,2017]
[null,null,null,null,null,null,null,null,null,null,5,2018]
[null,null,null,null,null,null,null,null,null,null,6,2019]
[null,null,null,null,null,null,null,null,null,null,7,2020]
[null,null,null,null,null,null,null,null,null,null,8,2021]
[null,null,null,null,null,null,null,null,null,null,9,2022]
[null,null,null,null,null,null,null,null,null,null,10,2023]
[]
[null,null,null,null,null,null,null,null,null,null,{"$f":"VLOOKUP(M98,K97:L106,2,FALSE)","v":2018}]
[]
[null,null,null,null,null,null,null,null,null,null,{"$f":"K79&\" \"&K95&\" \"&K108","v":"10 Fevrier 2018"}]

{"sheet":"Liste","index":2,"n_rows":39,"n_cols":14,"rows_kept":39,"cut":false,"hidden":false,"merged":[[5,1,6,8],[7,1,8,8],[12,1,13,8],[38,7,38,8],[16,11,17,18],[19,12,20,17],[22,12,23,17],[10,1,10,8],[25,1,26,8],[27,12,28,17],[30,13,31,16]]}
[null,null,null,{"$f":"\"     \"&Prépa!$C$1","v":"     FEDERATION FRANCAISE"},null,null,null,null,{"$f":"IF(Prépa!$O$92<>0,\"Saison \"&Prépa!$O$92,\"\")","v":"Saison 2017 - 2018"}]
[null,null,null,{"$f":"\"     \"&Prépa!$C$2","v":"     HANDISPORT"},null,null,null,null,{"$f":"IF(Prépa!$O$79<>0,Prépa!$O$79,\"\")","v":"2ème Tour"}]
[]
[]
[]
[null,{"$f":"IF(Prépa!$O$10<>0,Prépa!$O$10,\"\")","v":"Critérium Fédéral"}]
[]
[null,{"$f":"IF(Prépa!$D$14<>0,Prépa!$D$14,\"\")&IF(Prépa!$K$110<>0,\" - \"&Prépa!$K$110,\"\")","v":"TOURS - 10 Fevrier 2018"}]
[]
[]
[]
[]
[null,{"$f":"IF(Prépa!$O$29<>\"\",\" Liste \"&Prépa!$O$29,\"\")","v":" Liste Nat 2A Nord"}]
[]
[]
[null,null,"Doss.","N° Licence","Noms - prénoms","Classe","Zone","Pts FFTT","Associacions"]
[null,1,1,null,"RUTLER Sébastien",5,"NE",null,"PPN NEUVILLE EN FERRAIN",null,null,"Trier la liste par :"]
[null,2,2,null,"LE MOAL Bruno",2,"NO",null,"F.O.L.C.L.O."]
[null,3,3,null,"PLET Victorien",5,"NO",null,"US SAINT BERTHEVIN/SAINT LOUP"]
[null,4,4,null,"DEFRENEIX Samuel",5,"NO",null,"CTT DEOLS",null,null,null,"Classements C"]
[null,5,5,"WO","MANIER William",4,"NE",null,"CGL SUD OISE TT"]
[null,6,6,null,"PIERROT Tristan",4,"NO",null,"TT JOUE LES TOURS"]
[null,7,7,null,"FILLOU Marie-Christine",3,"NO",null,"SAINT-AVERTIN STT",null,null,null,"Dossards C"]
[null,8,8,null,"GOLLNISCH Laurent",5,"NE",null,"MOULINS LES METZ HANDISPORT"]
[null,null,{"$f":"8-COUNTBLANK($C$17:$C$24)","v":8},null,null,{"$f":"8-COUNTBLANK($H$17:$H$24)","v":0}]
[null,{"$f":"IF(Prépa!$O$32<>\"\",\" Liste \"&Prépa!$O$32,\"\")","v":" Liste Nat 2B Nord"},null,null,null,null,null,null,null,null,null,null,1]
[]
[null,null,null,null,null,null,null,null,null,null,null,null,"Débloquer C"]
[null,null,"Doss.","N° Licence","Noms - prénoms","Classe","Zone","Pts FFTT","Associacions"]
[null,1,9,null,"PAPIRER Alan",1,"NE",null,"MOULINS LES METZ HANDISPORT"]
[null,2,10,null,"HASLE Stéphane",5,"NO",null,"THORIGNE-FOUILLARD TT",null,null,null,null,"RAZ C"]
[null,3,11,null,"ADJAL Yorick",3,"NE",null,"A. VOISINS TT"]
[null,4,12,null,"SIREAU GOSSIAUX Florence",2,"NE",null,"A. VOISINS TT"]
[null,5,13,null,"KERGOSIEN Arnaud",3,"NO",null,"F.O.L.C.L.O."]
[null,6,14,null,"BELTRAND Arnaud",4,"NO",null,"TT JOUE LES TOURS"]
[null,7,15,null,"DUBOIS Gilles",3,"NO",null,"LE MANS SARTHE TT"]
[null,8,16,"WO","HENOUX Frédéric",5,"NE",null,"CTT CHATEAU THIERRY"]
[null,null,{"$f":"8-COUNTBLANK($C$30:$C$37)","v":8},null,null,{"$f":"8-COUNTBLANK($H$30:$H$37)","v":0}]
[null,null,null,null,null,null,null,{"$f":"IF(Prépa!E33<>\"\",Prépa!E33,\"\")","v":"Nico Angenon"}]

{"sheet":"Poules","index":3,"n_rows":41,"n_cols":34,"rows_kept":41,"cut":false,"hidden":false,"merged":[[19,9,20,12],[17,16,17,20],[17,21,17,25],[19,16,19,20],[19,21,19,25],[2,1,3,38],[5,1,6,38],[8,1,9,38],[16,14,16,25],[18,16,18,20],[18,21,18,25],[13,27,13,32],[10,14,10,25],[16,7,17,12],[19,27,19,32],[20,16,20,20],[22,16,22,20],[20,21,20,25],[22,21,22,25],[21,16,21,20],[21,21,21,25],[26,27,26,32],[27,27,27,32],[28,27,28,32],[28,15,28,24],[10,27,12,32],[20,27,20,32],[21,27,21,32],[22,27,22,32],[23,27,23,32],[24,27,24,32],[25,27,25,32],[14,27,14,32],[15,27,15,32],[16,27,16,32],[17,27,17,32],[18,27,18,32],[40,16,40,20],[40,21,40,25],[35,16,35,20],[35,21,35,25],[36,16,36,20],[36,21,36,25],[37,16,37,20],[37,21,37,25],[38,16,38,20],[38,21,38,25],[39,16,39,20],[39,21,39,25],[34,16,34,20],[34,21,34,25],[13,15,13,24],[25,16,25,20],[25,21,25,25],[23,16,23,20],[31,14,31,25],[32,16,32,20],[32,21,32,25],[33,16,33,20],[33,21,33,25],[23,21,23,25],[24,16,24,20],[24,21,24,25]]}
[null,null,null,null,{"$f":"\"    \"&Prépa!$C$1","v":"    FEDERATION FRANCAISE"},null,null,null,null,null,null,null,null,null,null,null,null,null,null,null,null,null,null,null,null,null,null,null,null,null,null,null,null,{"$f":"IF(Prépa!$O$92<>0,\"Saison \"&Prépa!$O$92,\"\")","v":"Saison 2017 - 2018"}]
[null,null,null,null,{"$f":"\"     \"&Prépa!$C$2","v":"     HANDISPORT"},null,null,null,null,null,null,null,null,null,null,null,null,null,null,null,null,null,null,null,null,null,null,null,null,null,null,null,null,{"$f":"IF(Prépa!$O$79<>0,Prépa!$O$79,\"\")","v":"2ème Tour"}]
[null,{"$f":"IF(Prépa!$O$10<>0,Prépa!$O$10,\"\")","v":"Critérium Fédéral"}]
[]
[]
[null,{"$f":"IF(Prépa!$D$14<>0,Prépa!$D$14,\"\")&IF(Prépa!$K$110<>0,\" - \"&Prépa!$K$110,\"\")","v":"TOURS - 10 Fevrier 2018"}]
[]
[]
[null,{"$f":"IF(Prépa!$O$29<>\"\",Prépa!$O$29,\"\")&\"  -  \"&IF(Prépa!$O$32<>\"\",Prépa!$O$32,\"\")","v":"Nat 2A Nord  -  Nat 2B Nord"}]
[]
[null,null,null,null,null,null,null,null,null,null,null,null,null,null,null,null,null,null,null,null,null,null,null,null,null,null,null,"Ordre des parties des          4er tours"]
[]
[]
[null,null,null,null,null,null,null,null,null,null,null,null,null,null,null,"DOSSARDS A PLACER DANS LA POULE",null,null,null,null,null,null,null,null,null,null,null,"1 - 8"]
[null,null,null,null,null,null,null,null,null,null,null,null,null,null,null,null,{"$f":"IF(Liste!$C$17<>\"\",Liste!$C$17,\"\")","v":1},{"$f":"IF(Liste!$C$18<>\"\",Liste!$C$18,\"\")","v":2},{"$f":"IF(Liste!$C$19<>\"\",Liste!$C$19,\"\")","v":3},{"$f":"IF(Liste!$C$20<>\"\",Liste!$C$20,\"\")","v":4},{"$f":"IF(Liste!$C$21<>\"\",Liste!$C$21,\"\")","v":5},{"$f":"IF(Liste!$C$22<>\"\",Liste!$C$22,\"\")","v":6},{"$f":"IF(Liste!$C$23<>\"\",Liste!$C$23,\"\")","v":7},{"$f":"IF(Liste!$C$24<>\"\",Liste!$C$24,\"\")","v":8},null,null,null,"2 - 7"]
[null,null,null,null,null,null,null,null,null,null,null,null,null,null,null,null,null,null,null,null,null,null,null,null,null,null,null,"3 - 6"]
[null,null,null,null,null,null,null,"   Débloquer C",null,null,null,null,null,0,"GROUPE A",null,null,null,null,null,null,null,null,null,null,null,null,"4 - 5"]
[null,null,null,null,null,null,null,null,null,null,null,null,null,null,null,"Doss","Noms -Prénoms",null,null,null,null,"Associations",null,null,null,null,null,"1 - 7"]
[null,null,null,null,null,null,null,null,null,null,null,null,0,null,1,1,{"$f":"IF($P$19<>\"\",VLOOKUP($P$19,Liste!$C$17:$I$24,3,FALSE),\"\")","v":"RUTLER Sébastien"},null,null,null,null,{"$f":"IF($P$19<>\"\",VLOOKUP($P$19,Liste!$C$17:$I$24,7,FALSE),\"\")","v":"PPN NEUVILLE EN FERRAIN"},null,null,null,null,null,"6 - 8"]
[null,null,null,null,null,null,null,null,null,"   RAZ C",null,null,null,null,2,2,{"$f":"IF($P$20<>\"\",VLOOKUP($P$20,Liste!$C$17:$I$24,3,FALSE),\"\")","v":"LE MOAL Bruno"},null,null,null,null,{"$f":"IF($P$20<>\"\",VLOOKUP($P$20,Liste!$C$17:$I$24,7,FALSE),\"\")","v":"F.O.L.C.L.O."},null,null,null,null,null,"2 - 5"]
[null,null,null,null,null,null,null,null,null,null,null,null,null,null,3,3,{"$f":"IF($P$21<>\"\",VLOOKUP($P$21,Liste!$C$17:$I$24,3,FALSE),\"\")","v":"PLET Victorien"},null,null,null,null,{"$f":"IF($P$21<>\"\",VLOOKUP($P$21,Liste!$C$17:$I$24,7,FALSE),\"\")","v":"US SAINT BERTHEVIN/SAINT LOUP"},null,null,null,null,null,"3 - 4"]
[null,null,null,null,null,null,null,null,null,null,null,null,null,null,4,4,{"$f":"IF($P$22<>\"\",VLOOKUP($P$22,Liste!$C$17:$I$24,3,FALSE),\"\")","v":"DEFRENEIX Samuel"},null,null,null,null,{"$f":"IF($P$22<>\"\",VLOOKUP($P$22,Liste!$C$17:$I$24,7,FALSE),\"\")","v":"CTT DEOLS"},null,null,null,null,null,"1 - 6"]
[null,null,null,null,null,null,null,null,null,null,null,null,null,null,5,5,{"$f":"IF($P$23<>\"\",VLOOKUP($P$23,Liste!$C$17:$I$24,3,FALSE),\"\")","v":"MANIER William"},null,null,null,null,{"$f":"IF($P$23<>\"\",VLOOKUP($P$23,Liste!$C$17:$I$24,7,FALSE),\"\")","v":"CGL SUD OISE TT"},null,null,null,null,null,"5 - 7"]
[null,null,null,null,null,null,null,null,null,null,null,null,null,null,6,6,{"$f":"IF($P$24<>\"\",VLOOKUP($P$24,Liste!$C$17:$I$24,3,FALSE),\"\")","v":"PIERROT Tristan"},null,null,null,null,{"$f":"IF($P$24<>\"\",VLOOKUP($P$24,Liste!$C$17:$I$24,7,FALSE),\"\")","v":"TT JOUE LES TOURS"},null,null,null,null,null,"4 - 8"]
[null,null,null,null,null,null,null,null,null,null,null,null,null,null,7,7,{"$f":"IF($P$25<>\"\",VLOOKUP($P$25,Liste!$C$17:$I$24,3,FALSE),\"\")","v":"FILLOU Marie-Christine"},null,null,null,null,{"$f":"IF($P$25<>\"\",VLOOKUP($P$25,Liste!$C$17:$I$24,7,FALSE),\"\")","v":"SAINT-AVERTIN STT"},null,null,null,null,null,"2 - 3"]
[null,null,null,null,null,null,null,null,null,null,null,null,null,null,8,8,{"$f":"IF($P$26<>\"\",VLOOKUP($P$26,Liste!$C$17:$I$24,3,FALSE),\"\")","v":"GOLLNISCH Laurent"},null,null,null,null,{"$f":"IF($P$26<>\"\",VLOOKUP($P$26,Liste!$C$17:$I$24,7,FALSE),\"\")","v":"MOULINS LES METZ HANDISPORT"},null,null,null,null,null,"1 - 5"]
[null,null,null,null,null,null,null,null,null,null,null,null,null,null,null,null,null,null,null,null,null,null,null,null,null,null,null,"4 - 6"]
[null,null,null,null,null,null,null,null,null,null,null,null,null,null,null,null,null,null,null,null,null,null,null,null,null,null,null,"3 - 7"]
[null,null,null,null,null,null,null,null,null,null,null,null,null,null,null,"DOSSARDS A PLACER DANS LA POULE",null,null,null,null,null,null,null,null,null,null,null,"2 - 8"]
[null,null,null,null,null,null,null,null,null,null,null,null,null,null,null,null,{"$f":"IF(Liste!$C$30<>\"\",Liste!$C$30,\"\")","v":9},{"$f":"IF(Liste!$C$31<>\"\",Liste!$C$31,\"\")","v":10},{"$f":"IF(Liste!$C$32<>\"\",Liste!$C$32,\"\")","v":11},{"$f":"IF(Liste!$C$33<>\"\",Liste!$C$33,\"\")","v":12},{"$f":"IF(Liste!$C$34<>\"\",Liste!$C$34,\"\")","v":13},{"$f":"IF(Liste!$C$35<>\"\",Liste!$C$35,\"\")","v":14},{"$f":"IF(Liste!$C$36<>\"\",Liste!$C$36,\"\")","v":15},{"$f":"IF(Liste!$C$37<>\"\",Liste!$C$37,\"\")","v":16}]
[]
[null,null,null,null,null,null,null,null,null,null,null,null,null,null,"GROUPE B"]
[null,null,null,null,null,null,null,null,null,null,null,null,null,null,null,"Doss","Noms -Prénoms",null,null,null,null,"Associations"]
[null,null,null,null,null,null,null,null,null,null,null,null,null,null,1,9,{"$f":"IF($P34<>\"\",VLOOKUP($P34,Liste!$C$30:$I$37,3,FALSE),\"\")","v":"PAPIRER Alan"},null,null,null,null,{"$f":"IF($P34<>\"\",VLOOKUP($P34,Liste!$C$30:$I$37,7,FALSE),\"\")","v":"MOULINS LES METZ HANDISPORT"}]
[null,null,null,null,null,null,null,null,null,null,null,null,null,null,2,16,{"$f":"IF($P35<>\"\",VLOOKUP($P35,Liste!$C$30:$I$37,3,FALSE),\"\")","v":"HENOUX Frédéric"},null,null,null,null,{"$f":"IF($P35<>\"\",VLOOKUP($P35,Liste!$C$30:$I$37,7,FALSE),\"\")","v":"CTT CHATEAU THIERRY"}]
[null,null,null,null,null,null,null,null,null,null,null,null,null,null,3,11,{"$f":"IF($P36<>\"\",VLOOKUP($P36,Liste!$C$30:$I$37,3,FALSE),\"\")","v":"ADJAL Yorick"},null,null,null,null,{"$f":"IF($P36<>\"\",VLOOKUP($P36,Liste!$C$30:$I$37,7,FALSE),\"\")","v":"A. VOISINS TT"}]
[null,null,null,null,null,null,null,null,null,null,null,null,null,null,4,13,{"$f":"IF($P37<>\"\",VLOOKUP($P37,Liste!$C$30:$I$37,3,FALSE),\"\")","v":"KERGOSIEN Arnaud"},null,null,null,null,{"$f":"IF($P37<>\"\",VLOOKUP($P37,Liste!$C$30:$I$37,7,FALSE),\"\")","v":"F.O.L.C.L.O."}]
[null,null,null,null,null,null,null,null,null,null,null,null,null,null,5,14,{"$f":"IF($P38<>\"\",VLOOKUP($P38,Liste!$C$30:$I$37,3,FALSE),\"\")","v":"BELTRAND Arnaud"},null,null,null,null,{"$f":"IF($P38<>\"\",VLOOKUP($P38,Liste!$C$30:$I$37,7,FALSE),\"\")","v":"TT JOUE LES TOURS"}]
[null,null,null,null,null,null,null,null,null,null,null,null,null,null,6,12,{"$f":"IF($P39<>\"\",VLOOKUP($P39,Liste!$C$30:$I$37,3,FALSE),\"\")","v":"SIREAU GOSSIAUX Florence"},null,null,null,null,{"$f":"IF($P39<>\"\",VLOOKUP($P39,Liste!$C$30:$I$37,7,FALSE),\"\")","v":"A. VOISINS TT"}]
[null,null,null,null,null,null,null,null,null,null,null,null,null,null,7,15,{"$f":"IF($P40<>\"\",VLOOKUP($P40,Liste!$C$30:$I$37,3,FALSE),\"\")","v":"DUBOIS Gilles"},null,null,null,null,{"$f":"IF($P40<>\"\",VLOOKUP($P40,Liste!$C$30:$I$37,7,FALSE),\"\")","v":"LE MANS SARTHE TT"}]
[null,null,null,null,null,null,null,null,null,null,null,null,null,null,8,10,{"$f":"IF($P41<>\"\",VLOOKUP($P41,Liste!$C$30:$I$37,3,FALSE),\"\")","v":"HASLE Stéphane"},null,null,null,null,{"$f":"IF($P41<>\"\",VLOOKUP($P41,Liste!$C$30:$I$37,7,FALSE),\"\")","v":"THORIGNE-FOUILLARD TT"}]

{"sheet":"GROUPE A","index":4,"n_rows":67,"n_cols":81,"rows_kept":67,"cut":false,"hidden":false,"merged":[[2,0,3,30],[5,0,6,30],[8,0,9,30],[15,13,15,15],[24,1,25,1],[24,0,25,0],[24,2,25,4],[24,5,25,5],[14,13,14,15],[14,16,14,17],[14,18,14,19],[4,6,4,25],[19,1,19,9],[19,10,19,12],[19,13,19,15],[19,16,19,17],[19,18,19,19],[18,1,18,9],[18,10,18,12],[18,13,18,15],[18,16,18,17],[18,18,18,19],[22,10,22,12],[22,13,22,15],[49,13,49,18],[29,35,30,42],[24,6,25,10],[17,20,17,21],[24,11,25,13],[24,14,25,18],[24,19,25,19],[22,22,22,32],[20,20,20,21],[21,13,21,15],[21,18,21,19],[21,20,21,21],[21,22,21,32],[21,1,21,9],[21,10,21,12],[22,1,22,9],[26,35,27,42],[20,35,21,42],[23,35,24,42],[20,1,20,9],[20,10,20,12],[20,13,20,15],[20,16,20,17],[20,18,20,19],[59,2,59,3],[59,4,59,12],[59,13,59,14],[59,15,59,16],[59,17,59,18],[38,6,38,11],[38,13,38,18],[39,6,39,11],[39,13,39,18],[40,6,40,11],[40,13,40,18],[41,6,41,11],[41,13,41,18],[43,6,43,11],[43,13,43,18],[44,6,44,11],[44,13,44,18],[53,6,53,11],[45,6,45,11],[45,13,45,18],[46,6,46,11],[46,13,46,18],[47,6,47,11],[47,13,47,18],[60,2,60,3],[60,4,60,12],[60,13,60,14],[60,15,60,16],[60,17,60,18],[61,15,61,16],[66,2,66,3],[66,13,66,14],[65,2,65,3],[65,4,65,12],[65,13,65,14],[61,2,61,3],[62,2,62,3],[63,2,63,3],[63,4,63,12],[63,13,63,14],[64,2,64,3],[64,4,64,12],[64,13,64,14],[62,4,62,12],[62,13,62,14],[61,4,61,12],[61,13,61,14],[51,49,51,50],[36,65,36,66],[64,19,64,26],[65,19,66,26],[30,13,30,18],[31,6,31,11],[31,13,31,18],[32,6,32,11],[32,13,32,18],[33,6,33,11],[33,63,33,68],[63,19,63,26],[61,17,61,18],[35,67,35,68],[34,67,34,68],[34,65,34,66],[50,47,50,52],[35,65,35,66],[66,4,66,12],[37,6,37,11],[37,13,37,18],[51,47,51,48],[31,63,31,64],[35,63,35,64],[36,67,36,68],[36,63,36,64],[29,13,29,18],[34,63,34,64],[27,6,27,11],[27,13,27,18],[30,6,30,11],[27,65,27,66],[28,6,28,11],[28,13,28,18],[27,63,27,64],[34,13,34,18],[35,6,35,11],[35,13,35,18],[36,6,36,11],[36,13,36,18],[27,67,27,68],[31,67,31,68],[31,65,31,66],[32,35,33,42],[58,17,58,18],[54,0,55,19],[58,2,58,3],[58,4,58,12],[58,13,58,14],[29,6,29,11],[58,19,58,20],[42,6,42,11],[42,13,42,18],[33,13,33,18],[51,6,51,11],[52,6,52,11],[50,6,50,11],[50,13,50,18],[51,13,51,18],[52,13,52,18],[53,13,53,18],[57,1,57,14],[58,15,58,16],[54,20,54,24],[55,20,55,24],[48,6,48,11],[48,13,48,18],[49,6,49,11],[29,74,29,75],[29,76,29,77],[28,70,28,71],[28,72,28,73],[28,74,28,75],[28,76,28,77],[29,70,29,71],[29,72,29,73],[27,76,27,77],[27,72,27,73],[45,55,45,56],[26,6,26,11],[26,13,26,18],[45,47,45,48],[45,49,45,50],[45,51,45,52],[45,53,45,54],[40,36,41,40],[44,47,44,58],[34,6,34,11],[37,36,38,41],[24,63,24,64],[20,70,20,71],[19,70,19,77],[20,76,20,77],[22,76,22,77],[20,74,20,75],[21,76,21,77],[27,70,27,71],[18,69,18,70],[22,74,22,75],[21,74,21,75],[27,74,27,75],[26,62,26,68],[22,70,22,71],[21,72,21,73],[20,67,20,68],[19,62,19,68],[18,65,18,66],[26,70,26,77],[20,72,20,73],[24,65,24,66],[24,67,24,68],[21,70,21,71],[22,72,22,73],[6,76,6,77],[15,10,15,12],[15,18,15,19],[15,20,15,21],[16,16,16,17],[17,16,17,17],[15,16,15,17],[16,20,16,21],[18,67,18,68],[15,74,15,75],[15,72,15,73],[16,10,16,12],[16,13,16,15],[16,65,16,66],[16,67,16,68],[17,13,17,15],[18,63,18,64],[18,20,18,21],[18,22,18,32],[15,76,15,77],[15,63,15,64],[15,65,15,66],[15,67,15,68],[15,70,15,71],[14,70,14,71],[14,72,14,73],[11,56,12,57],[13,72,13,73],[13,74,13,75],[12,70,12,77],[13,76,13,77],[13,67,13,68],[14,76,14,77],[13,70,13,71],[14,67,14,68],[14,63,14,64],[14,65,14,66],[13,65,13,66],[10,62,11,80],[4,70,4,77],[24,25,24,32],[14,22,14,32],[15,22,15,32],[16,22,16,32],[17,22,17,32],[20,22,20,32],[6,72,6,73],[6,74,6,75],[8,47,8,48],[8,50,8,51],[5,72,5,73],[5,74,5,75],[7,76,7,77],[5,76,5,77],[3,47,6,54],[5,70,5,71],[7,70,7,71],[7,72,7,73],[7,74,7,75],[5,65,5,66],[19,22,19,32],[6,70,6,71],[14,74,14,75],[14,1,14,9],[14,10,14,12],[14,20,14,21],[7,35,9,42],[10,0,13,30],[11,47,12,48],[15,1,15,9],[17,10,17,12],[16,1,16,9],[17,1,17,9],[17,18,17,19],[17,35,18,42],[10,35,11,42],[14,35,15,42],[16,18,16,19],[22,16,22,17],[22,18,22,19],[22,20,22,21],[21,16,21,17],[4,63,4,64],[9,50,9,51],[13,63,13,64],[5,63,5,64],[12,62,12,68],[5,67,5,68],[11,50,12,51],[11,53,12,54],[16,63,16,64],[17,63,17,64],[4,65,4,66],[4,67,4,68],[20,63,20,64],[20,65,20,66],[19,20,19,21],[17,65,17,66],[17,67,17,68],[9,47,9,48]]}
[null,null,null,null,{"$f":"Prépa!$C$1","v":"FEDERATION FRANCAISE"},null,null,null,null,null,null,null,null,null,null,null,null,null,null,null,null,null,null,null,null,null,null,null,null,null,null,null,{"$f":"IF(Prépa!$O$92<>0,\"Saison \"&Prépa!$O$92,\"\")","v":"Saison 2017 - 2018"}]
[null,null,null,null,{"$f":"Prépa!$C$2","v":"HANDISPORT"},null,null,null,null,null,null,null,null,null,null,null,null,null,null,null,null,null,null,null,null,null,null,null,null,null,null,null,{"$f":"IF(Prépa!$O$79<>0,Prépa!$O$79,\"\")","v":"2ème Tour"}]
[{"$f":"IF(Prépa!$O$10<>0,Prépa!$O$10,\"\")&IF(Prépa!$O$29<>\"\",\" - \"&Prépa!$O$29,\"\")","v":"Critérium Fédéral - Nat 2A Nord"}]
[null,null,null,null,null,null,null,null,null,null,null,null,null,null,null,null,null,null,null,null,null,null,null,null,null,null,null,null,null,null,null,null,null,null,null,null,null,null,null,null,null,null,null,null,null,null,null,{"$f":"A11","v":0}]
[null,null,null,null,null,null,null,null,null,null,null,null,null,null,null,null,null,null,null,null,null,null,null,null,null,null,null,null,null,null,null,null,null,null,null,null,null,null,null,null,null,null,null,null,null,null,null,null,null,null,null,null,null,null,null,null,null,null,null,null,null,null,null,{"$f":"IF($K$16<>\"\",\"Joueur 1\",\"\")","v":"Joueur 1"},null,{"$f":"IF($K$17<>\"\",\"Joueur 2\",\"\")","v":"Joueur 2"},null,{"$f":"IF($K$18<>\"\",\"Joueur 3\",\"\")","v":"Joueur 3"},null,null,"Classement avant départage"]
[{"$f":"IF(Prépa!$D$14<>0,Prépa!$D$14,\"\")&IF(Prépa!$K$110<>0,\" - \"&Prépa!$K$110,\"\")","v":"TOURS - 10 Fevrier 2018"},null,null,null,null,null,null,null,null,null,null,null,null,null,null,null,null,null,null,null,null,null,null,null,null,null,null,null,null,null,null,null,null,null,null,null,null,null,null,null,null,null,null,null,null,null,null,null,null,null,null,null,null,null,null,null,null,null,null,null,null,null,"Total des victoires è",{"$f":"IF($AB$55<>\"\",$AB$55,\"\")","v":2},null,{"$f":"IF($AC$55<>\"\",$AC$55,\"\")","v":2},null,{"$f":"IF($AD$55<>\"\",$AD$55,\"\")","v":0},null,null,null,null,{"$f":"IF($K$16<>\"\",\"Joueur 1\",\"\")","v":"Joueur 1"},null,{"$f":"IF($K$17<>\"\",\"Joueur 2\",\"\")","v":"Joueur 2"},null,{"$f":"IF($K$18<>\"\",\"Joueur 3\",\"\")","v":"Joueur 3"}]
[null,null,null,null,null,null,null,null,null,null,null,null,null,null,null,null,null,null,null,null,null,null,null,null,null,null,null,null,null,null,null,null,null,null,null,null,null,null,null,null,null,null,null,null,null,null,null,null,null,null,null,null,null,null,null,null,null,null,null,null,null,null,null,null,null,null,null,null,null,null,"Points",null,{"$f":"IF($BL$6<>\"\",$BL$6,\"\")","v":2},null,{"$f":"IF($BN$6<>\"\",$BN$6,\"\")","v":2},null,{"$f":"IF($BP$6<>\"\",$BP$6,\"\")","v":0},null,{"$f":"IF($BU$8=\"?\",COUNTIF($BU$7:$BZ$7,$BU$7),\"\")","v":""},{"$f":"IF($BW$8=\"?\",COUNTIF($BU$7:$BZ$7,$BW$7),\"\")","v":""},{"$f":"IF($BY$8=\"?\",COUNTIF($BU$7:$BZ$7,$BY$7),\"\")","v":""}]
[null,null,null,null,null,null,null,null,null,null,null,null,null,null,null,null,null,null,null,null,null,null,null,null,null,null,null,null,null,null,null,null,null,null,null,"IMPRIMER",null,null,null,null,null,null,null,null,null,null,null,null,null,null,null,null,null,null,null,null,null,null,null,null,null,null,null,null,null,null,null,null,null,null,"Rang",null,{"$f":"IF($BL$6<>\"\",IF($AY$10=$AV$10,IF($BU$7=$BW$7,\"?\",IF($BU$7=$BY$7,\"?\",RANK($BU$7,$BU$7:$BZ$7))),\"\"),\"\")","v":""},null,{"$f":"IF($BN$6<>\"\",IF($AV$10=$AY$10,IF($BW$7=$BU$7,\"?\",IF($BW$7=$BY$7,\"?\",RANK($BW$7,$BU$7:$BZ$7))),\"\"),\"\")","v":""},null,{"$f":"IF($BP$6<>\"\",IF($AV$10=$AY$10,IF($BY$7=$BU$7,\"?\",IF($BY$7=$BW$7,\"?\",RANK($BY$7,$BU$7:$BZ$7))),\"\"),\"\")","v":""},null,{"$f":"IF($BU$8<>\"\",SUM($CA$7:$CC$7),\"\")","v":""}]
[{"$f":"IF(Prépa!$O$72<>\"\",Prépa!$O$72,\"\")","v":"OPEN Assis"},null,null,null,null,null,null,null,null,null,null,null,null,null,null,null,null,null,null,null,null,null,null,null,null,null,null,null,null,null,null,null,null,null,null,null,null,null,null,null,null,null,null,null,null,null,null,"A jouer",null,null,"Jouées"]
[null,null,null,null,null,null,null,null,null,null,null,null,null,null,null,null,null,null,null,null,null,null,null,null,null,null,null,null,null,null,null,null,null,null,null,null,null,null,null,null,null,null,null,null,null,null,null,{"$f":"($K$19*($K$19-1)/2)","v":6},null,null,{"$f":"SUM($AW$14:$AW$17)","v":0}]
[null,null,null,null,null,null,null,null,null,null,null,null,null,null,null,null,null,null,null,null,null,null,null,null,null,null,null,null,null,null,null,null,null,null,null,"  Feuille de Poule C",null,null,null,null,null,null,null,null,null,null,null,null,null,null,null,null,null,null,null,null,null,null,null,null,null,null,"1er DEPARTAGE"]
[null,null,null,null,null,null,null,null,null,null,null,null,null,null,null,null,null,null,null,null,null,null,null,null,null,null,null,null,null,null,null,null,null,null,null,null,null,null,null,null,null,null,null,null,null,null,null,"Parties",null,null,"Forfaits",null,null,"Manches",null,null,"Points parties"]
[null,null,null,null,null,null,null,null,null,null,null,null,null,null,null,null,null,null,null,null,null,null,null,null,null,null,null,null,null,null,null,null,null,null,null,null,null,null,null,null,null,null,null,null,null,null,null,null,null,null,null,true,null,null,null,null,null,null,null,null,null,null,"Départage aux parties Niveau 1",null,null,null,null,null,null,null,"Clt après départage au parties"]
[null,null,null,null,null,null,null,null,null,null,null,null,null,null,null,null,null,null,null,null,null,null,null,null,null,null,null,null,null,null,null,null,null,null,null,null,null,null,null,null,null,null,null,null,null,null,null,{"$f":"IF(AND($C$27<>\"\",$E$27<>\"\"),$C$27&\" - \"&$E$27,\"\")","v":"1 - 8"},{"$f":"IF($Z$27<>\"\",1,0)","v":0},null,{"$f":"IF($F$27=\"F\",1,0)","v":0},{"$f":"IF($T$27=\"F\",1,0)","v":0},null,{"$f":"IF($AZ$14=1,3,IF($U$27<>\"\",COUNTIF($U$27:$Y$27,\">=0\"),0))","v":0},{"$f":"IF($AY$14=1,3,IF($U$27<>\"\",COUNTIF($U$27:$Y$27,\"<0\"),0))","v":0},null,{"$f":"IF($AY$14=1,0,IF($AZ$14=1,2,IF($BB$14<>\"\",IF($BB$14=3,2,IF($BC$14=3,1,\"\")),\"\")))","v":""},{"$f":"IF($AZ$14=1,0,IF($AY$14=1,2,IF($BC$14<>\"\",IF($BC$14=3,2,IF($BB$14=3,1,\"\")),\"\")))","v":""},null,null,null,null,null,{"$f":"IF($BU$8=\"?\",\"joueur 1\",\"\")","v":""},null,{"$f":"IF($BW$8=\"?\",\"joueur 2\",\"\")","v":""},null,{"$f":"IF($BY$8=\"?\",\"joueur 3\",\"\")","v":""},null,null,null,null,{"$f":"IF($K$16<>\"\",\"Joueur 1\",\"\")","v":"Joueur 1"},null,{"$f":"IF($K$17<>\"\",\"Joueur 2\",\"\")","v":"Joueur 2"},null,{"$f":"IF($K$18<>\"\",\"Joueur 3\",\"\")","v":"Joueur 3"}]
["N°","NOM Prénom",null,null,null,null,null,null,null,null,"Dossard",null,null,"N° de Licence",null,null,"Classe",null,"Zone",null,"Pts FFTT",null,"Association",null,null,null,null,null,null,null,null,null,null,null,null,"     Parties Tour 1 C",null,null,null,null,null,null,null,null,null,null,null,{"$f":"IF(AND($C$28<>\"\",$E$28<>\"\"),$C$28&\" - \"&$E$28,\"\")","v":"2 - 7"},{"$f":"IF($Z$28<>\"\",1,0)","v":0},null,{"$f":"IF($F$28=\"F\",1,0)","v":0},{"$f":"IF($T$28=\"F\",1,0)","v":0},null,{"$f":"IF($AZ$15=1,3,IF($U$28<>\"\",COUNTIF($U$28:$Y$28,\">=0\"),0))","v":0},{"$f":"IF($AY$15=1,3,IF($U$28<>\"\",COUNTIF($U$28:$Y$28,\"<0\"),0))","v":0},null,{"$f":"IF($AY$15=1,0,IF($AZ$15=1,2,IF($BB$15<>\"\",IF($BB$15=3,2,IF($BC$15=3,1,\"\")),\"\")))","v":""},{"$f":"IF($AZ$15=1,0,IF($AY$15=1,2,IF($BC$15<>\"\",IF($BC$15=3,2,IF($BB$15=3,1,\"\")),\"\")))","v":""},null,null,null,null,{"$f":"IF($BL$14<>\"\",IF($BU$7=$BW$7,\"1 - 2\",\"\"),\"\")","v":""},{"$f":"IF($BK$15<>\"\",$BE$15,\"\")","v":""},null,{"$f":"IF($BK$15<>\"\",$BF$15,\"\")","v":""},null,null,null,null,"Points",null,{"$f":"IF($BL$18=\"\",$BU$7,($BU$7+($BL$18*0.1)))","v":2},null,{"$f":"IF($BN$18=\"\",$BW$7,($BW$7+($BN$18*0.1)))","v":2},null,{"$f":"IF($BP$18=\"\",$BY$7,($BY$7+($BP$18*0.1)))","v":0},null,{"$f":"IF($BU$16=\"?\",COUNTIF($BU$15:$BZ$15,$BU$15),\"\")","v":""},{"$f":"IF($BW$16=\"?\",COUNTIF($BU$15:$BZ$15,$BW$15),\"\")","v":""},{"$f":"IF($BY$16=\"?\",COUNTIF($BU$15:$BZ$15,$BY$15),\"\")","v":""}]
[1,{"$f":"IF($K$16<>\"\",VLOOKUP($K$16,Liste!$C$17:$I$24,3,FALSE),\"\")","v":"RUTLER Sébastien"},null,null,null,null,null,null,null,null,{"$f":"IF(Poules!$P$19<>\"\",Poules!$P$19,\"\")","v":1},null,null,{"$f":"IF($K$16<>\"\",VLOOKUP($K$16,Liste!$C$17:$I$24,2,FALSE),\"\")","v":0},null,null,{"$f":"IF($K$16<>\"\",VLOOKUP($K$16,Liste!$C$17:$I$24,4,FALSE),\"\")","v":5},null,{"$f":"IF($K$16<>\"\",VLOOKUP($K$16,Liste!$C$17:$I$24,5,FALSE),\"\")","v":"NE"},null,{"$f":"IF($K$16<>\"\",VLOOKUP($K$16,Liste!$C$17:$I$24,6,FALSE),\"\")","v":0},null,{"$f":"IF($K$16<>\"\",VLOOKUP($K$16,Liste!$C$17:$I$24,7,FALSE),\"\")","v":"PPN NEUVILLE EN FERRAIN"},null,null,null,null,null,null,null,null,null,null,null,null,null,null,null,null,null,null,null,null,null,null,null,null,{"$f":"IF(AND(C29<>\"\",E29<>\"\"),C29&\" - \"&E29,\"\")","v":"3 - 6"},{"$f":"IF(AB29<>\"\",1,0)","v":0},null,{"$f":"IF(F29=\"F\",1,0)","v":0},{"$f":"IF(T29=\"F\",1,0)","v":0},null,{"$f":"IF(AZ16=1,3,IF(U29<>\"\",COUNTIF(U29:Y29,\">=0\"),0))","v":0},{"$f":"IF(AY16=1,3,IF(U29<>\"\",COUNTIF(U29:Y29,\"<0\"),0))","v":0},null,{"$f":"IF(AY16=1,0,IF(AZ16=1,2,IF(BB16<>\"\",IF(BB16=3,2,IF(BC16=3,1,\"\")),\"\")))","v":""},{"$f":"IF(AZ16=1,0,IF(AY16=1,2,IF(BC16<>\"\",IF(BC16=3,2,IF(BB16=3,1,\"\")),\"\")))","v":""},null,null,null,null,{"$f":"IF($BL$14<>\"\",IF($BU$7=$BY$7,\"1 - 3\",\"\"),\"\")","v":""},{"$f":"IF($BK$16<>\"\",BE14,\"\")","v":""},null,null,null,{"$f":"IF($BK$16<>\"\",BF14,\"\")","v":""},null,null,"Rang",null,{"$f":"IF($BL$6<>\"\",IF($AV$10=$AY$10,IF($BU$15=$BW$15,\"?\",IF($BU$15=$BY$15,\"?\",RANK($BU$15,$BU$15:$BZ$15))),\"\"),\"\")","v":""},null,{"$f":"IF($BN$6<>\"\",IF($AV$10=$AY$10,IF($BW$15=$BU$15,\"?\",IF($BW$15=$BY$15,\"?\",RANK($BW$15,$BU$15:$BZ$15))),\"\"),\"\")","v":""},null,{"$f":"IF($BP$6<>\"\",IF($AV$10=$AY$10,IF($BY$15=$BU$15,\"?\",IF($BY$15=$BW$15,\"?\",RANK($BY$15,$BU$15:$BZ$15))),\"\"),\"\")","v":""},null,{"$f":"IF($BU$16<>\"\",SUM($CA$15:$CC$15),\"\")","v":""}]
[2,{"$f":"IF($K$17<>\"\",VLOOKUP($K$17,Liste!$C$17:$I$24,3,FALSE),\"\")","v":"LE MOAL Bruno"},null,null,null,null,null,null,null,null,{"$f":"IF(Poules!$P$20<>\"\",Poules!$P$20,\"\")","v":2},null,null,{"$f":"IF($K$17<>\"\",VLOOKUP($K$17,Liste!$C$17:$I$24,2,FALSE),\"\")","v":0},null,null,{"$f":"IF($K$17<>\"\",VLOOKUP($K$17,Liste!$C$17:$I$24,4,FALSE),\"\")","v":2},null,{"$f":"IF($K$17<>\"\",VLOOKUP($K$17,Liste!$C$17:$I$24,5,FALSE),\"\")","v":"NO"},null,{"$f":"IF($K$17<>\"\",VLOOKUP($K$17,Liste!$C$17:$I$24,6,FALSE),\"\")","v":0},null,{"$f":"IF($K$17<>\"\",VLOOKUP($K$17,Liste!$C$17:$I$24,7,FALSE),\"\")","v":"F.O.L.C.L.O."},null,null,null,null,null,null,null,null,null,null,null,null,null,null,null,null,null,null,null,null,null,null,null,null,{"$f":"IF(AND(C30<>\"\",E30<>\"\"),C30&\" - \"&E30,\"\")","v":"4 - 5"},{"$f":"IF(AB30<>\"\",1,0)","v":0},null,{"$f":"IF(F30=\"F\",1,0)","v":0},{"$f":"IF(T30=\"F\",1,0)","v":1},null,{"$f":"IF(AZ17=1,3,IF(U30<>\"\",COUNTIF(U30:Y30,\">=0\"),0))","v":3},{"$f":"IF(AY17=1,3,IF(U30<>\"\",COUNTIF(U30:Y30,\"<0\"),0))","v":0},null,{"$f":"IF(AY17=1,0,IF(AZ17=1,2,IF(BB17<>\"\",IF(BB17=3,2,IF(BC17=3,1,\"\")),\"\")))","v":2},{"$f":"IF(AZ17=1,0,IF(AY17=1,2,IF(BC17<>\"\",IF(BC17=3,2,IF(BB17=3,1,\"\")),\"\")))","v":0},null,null,null,null,{"$f":"IF($BN$14<>\"\",IF($BW$7=$BY$7,\"2 - 3\",\"\"),\"\")","v":""},null,null,{"$f":"IF($BK$17<>\"\",BE16,\"\")","v":""},null,{"$f":"IF($BK$17<>\"\",BF16,\"\")","v":""}]
[3,{"$f":"IF($K$18<>\"\",VLOOKUP($K$18,Liste!$C$17:$I$24,3,FALSE),\"\")","v":"PLET Victorien"},null,null,null,null,null,null,null,null,{"$f":"IF(Poules!$P$21<>\"\",Poules!$P$21,\"\")","v":3},null,null,{"$f":"IF($K$18<>\"\",VLOOKUP($K$18,Liste!$C$17:$I$24,2,FALSE),\"\")","v":0},null,null,{"$f":"IF($K$18<>\"\",VLOOKUP($K$18,Liste!$C$17:$I$24,4,FALSE),\"\")","v":5},null,{"$f":"IF($K$18<>\"\",VLOOKUP($K$18,Liste!$C$17:$I$24,5,FALSE),\"\")","v":"NO"},null,{"$f":"IF($K$18<>\"\",VLOOKUP($K$18,Liste!$C$17:$I$24,6,FALSE),\"\")","v":0},null,{"$f":"IF($K$18<>\"\",VLOOKUP($K$18,Liste!$C$17:$I$24,7,FALSE),\"\")","v":"US SAINT BERTHEVIN/SAINT LOUP"},null,null,null,null,null,null,null,null,null,null,null,null,"     Parties Tour 2 C",null,null,null,null,null,null,null,null,null,null,null,"1 - 7",0,null,0,0,null,0,0,null,"","",null,null,null,null,"Total",{"$f":"IF($BL$14<>\"\",SUM($BL$15:$BM$16),\"\")","v":""},null,{"$f":"IF($BN$14<>\"\",SUM($BN$15:$BO$17),\"\")","v":""},null,{"$f":"IF($BP$14<>\"\",SUM($BP$15:$BQ$17),\"\")","v":""}]
[4,{"$f":"IF($K$19<>\"\",VLOOKUP($K$19,Liste!$C$17:$I$24,3,FALSE),\"\")","v":"DEFRENEIX Samuel"},null,null,null,null,null,null,null,null,{"$f":"IF(Poules!$P$22<>\"\",Poules!$P$22,\"\")","v":4},null,null,{"$f":"IF($K$19<>\"\",VLOOKUP($K$19,Liste!$C$17:$I$24,2,FALSE),\"\")","v":0},null,null,{"$f":"IF($K$19<>\"\",VLOOKUP($K$19,Liste!$C$17:$I$24,4,FALSE),\"\")","v":5},null,{"$f":"IF($K$19<>\"\",VLOOKUP($K$19,Liste!$C$17:$I$24,5,FALSE),\"\")","v":"NO"},null,{"$f":"IF($K$19<>\"\",VLOOKUP($K$19,Liste!$C$17:$I$24,6,FALSE),\"\")","v":0},null,{"$f":"IF($K$19<>\"\",VLOOKUP($K$19,Liste!$C$17:$I$24,7,FALSE),\"\")","v":"CTT DEOLS"},null,null,null,null,null,null,null,null,null,null,null,null,null,null,null,null,null,null,null,null,null,null,null,null,"6 - 8",0,null,0,0,null,0,0,null,"",""]
[5,{"$f":"IF($K$20<>\"\",VLOOKUP($K$20,Liste!$C$17:$I$24,3,FALSE),\"\")","v":"MANIER William"},null,null,null,null,null,null,null,null,{"$f":"IF(Poules!$P$23<>\"\",Poules!$P$23,\"\")","v":5},null,null,{"$f":"IF($K$20<>\"\",VLOOKUP($K$20,Liste!$C$17:$I$24,2,FALSE),\"\")","v":"WO"},null,null,{"$f":"IF($K$20<>\"\",VLOOKUP($K$20,Liste!$C$17:$I$24,4,FALSE),\"\")","v":4},null,{"$f":"IF($K$20<>\"\",VLOOKUP($K$20,Liste!$C$17:$I$24,5,FALSE),\"\")","v":"NE"},null,{"$f":"IF($K$20<>\"\",VLOOKUP($K$20,Liste!$C$17:$I$24,6,FALSE),\"\")","v":0},null,{"$f":"IF($K$20<>\"\",VLOOKUP($K$20,Liste!$C$17:$I$24,7,FALSE),\"\")","v":"CGL SUD OISE TT"},null,null,null,null,null,null,null,null,null,null,null,null,null,null,null,null,null,null,null,null,null,null,null,null,"2 - 5",0,null,0,1,null,3,0,null,2,0,null,null,null,null,"Départage aux manches Niveau 1",null,null,null,null,null,null,null,"Clt après départage au manches"]
[6,{"$f":"IF($K$21<>\"\",VLOOKUP($K$21,Liste!$C$17:$I$24,3,FALSE),\"\")","v":"PIERROT Tristan"},null,null,null,null,null,null,null,null,{"$f":"IF(Poules!$P$24<>\"\",Poules!$P$24,\"\")","v":6},null,null,{"$f":"IF($K$21<>\"\",VLOOKUP($K$21,Liste!$C$17:$I$24,2,FALSE),\"\")","v":0},null,null,{"$f":"IF($K$21<>\"\",VLOOKUP($K$21,Liste!$C$17:$I$24,4,FALSE),\"\")","v":4},null,{"$f":"IF($K$21<>\"\",VLOOKUP($K$21,Liste!$C$17:$I$24,5,FALSE),\"\")","v":"NO"},null,{"$f":"IF($K$21<>\"\",VLOOKUP($K$21,Liste!$C$17:$I$24,6,FALSE),\"\")","v":0},null,{"$f":"IF($K$21<>\"\",VLOOKUP($K$21,Liste!$C$17:$I$24,7,FALSE),\"\")","v":"TT JOUE LES TOURS"},null,null,null,null,null,null,null,null,null,null,null,null,"     Parties Tour 3 C",null,null,null,null,null,null,null,null,null,null,null,"3 - 4",0,null,0,0,null,0,0,null,"","",null,null,null,null,null,{"$f":"IF(AND($BU$16=\"?\",$CA$16=$CA$8),\"joueur 1\",\"\")","v":""},null,{"$f":"IF(AND($BW$16=\"?\",$CA$16=$CA$8),\"joueur 2\",\"\")","v":""},null,{"$f":"IF(AND($BY$16=\"?\",$CA$16=$CA$8),\"joueur 3\",\"\")","v":""},null,null,null,null,{"$f":"IF($K$16<>\"\",\"Joueur 1\",\"\")","v":"Joueur 1"},null,{"$f":"IF($K$17<>\"\",\"Joueur 2\",\"\")","v":"Joueur 2"},null,{"$f":"IF($K$18<>\"\",\"Joueur 3\",\"\")","v":"Joueur 3"}]
[7,{"$f":"IF($K$22<>\"\",VLOOKUP($K$22,Liste!$C$17:$I$24,3,FALSE),\"\")","v":"FILLOU Marie-Christine"},null,null,null,null,null,null,null,null,{"$f":"IF(Poules!$P$25<>\"\",Poules!$P$25,\"\")","v":7},null,null,{"$f":"IF($K$22<>\"\",VLOOKUP($K$22,Liste!$C$17:$I$24,2,FALSE),\"\")","v":0},null,null,{"$f":"IF($K$22<>\"\",VLOOKUP($K$22,Liste!$C$17:$I$24,4,FALSE),\"\")","v":3},null,{"$f":"IF($K$22<>\"\",VLOOKUP($K$22,Liste!$C$17:$I$24,5,FALSE),\"\")","v":"NO"},null,{"$f":"IF($K$22<>\"\",VLOOKUP($K$22,Liste!$C$17:$I$24,6,FALSE),\"\")","v":0},null,{"$f":"IF($K$22<>\"\",VLOOKUP($K$22,Liste!$C$17:$I$24,7,FALSE),\"\")","v":"SAINT-AVERTIN STT"},null,null,null,null,null,null,null,null,null,null,null,null,null,null,null,null,null,null,null,null,null,null,null,null,"1 - 6",0,null,0,0,null,0,0,null,"","",null,null,null,null,{"$f":"IF($BL$21<>\"\",IF($BU$15=$BW$15,\"1 - 2\",\"\"),\"\")","v":""},{"$f":"IF($BK$22<>\"\",$BB$15,\"\")","v":""},{"$f":"IF($BK$22<>\"\",$BC$15,\"\")","v":""},{"$f":"IF($BK$22<>\"\",$BC$15,\"\")","v":""},{"$f":"IF($BK$22<>\"\",$BB$15,\"\")","v":""},null,null,null,"Points",null,{"$f":"IF($BL$25=\"\",$BU$15,($BU$15+($BL$25*0.01)))","v":2},null,{"$f":"IF($BN$25=\"\",$BW$15,($BW$15+($BN$25*0.01)))","v":2},null,{"$f":"IF($BP$25=\"\",$BY$15,($BY$15+($BP$25*0.01)))","v":0},null,{"$f":"IF($BU$23=\"?\",COUNTIF($BU$22:$BZ$22,$BU$22),\"\")","v":""},{"$f":"IF($BW$23=\"?\",COUNTIF($BU$22:$BZ$22,$BW$22),\"\")","v":""},{"$f":"IF($BY$23=\"?\",COUNTIF($BU$22:$BZ$22,$BY$22),\"\")","v":""}]
[8,{"$f":"IF($K$23<>\"\",VLOOKUP($K$23,Liste!$C$17:$I$24,3,FALSE),\"\")","v":"GOLLNISCH Laurent"},null,null,null,null,null,null,null,null,{"$f":"IF(Poules!$P$26<>\"\",Poules!$P$26,\"\")","v":8},null,null,{"$f":"IF($K$23<>\"\",VLOOKUP($K$23,Liste!$C$17:$I$24,2,FALSE),\"\")","v":0},null,null,{"$f":"IF($K$23<>\"\",VLOOKUP($K$23,Liste!$C$17:$I$24,4,FALSE),\"\")","v":5},null,{"$f":"IF($K$23<>\"\",VLOOKUP($K$23,Liste!$C$17:$I$24,5,FALSE),\"\")","v":"NE"},null,{"$f":"IF($K$23<>\"\",VLOOKUP($K$23,Liste!$C$17:$I$24,6,FALSE),\"\")","v":0},null,{"$f":"IF($K$23<>\"\",VLOOKUP($K$23,Liste!$C$17:$I$24,7,FALSE),\"\")","v":"MOULINS LES METZ HANDISPORT"},null,null,null,null,null,null,null,null,null,null,null,null,null,null,null,null,null,null,null,null,null,null,null,null,"5 - 7",0,null,1,0,null,0,3,null,0,2,null,null,null,null,{"$f":"IF($BL$21<>\"\",IF($BU$15=$BY$15,\"1 - 3\",\"\"),\"\")","v":""},{"$f":"IF($BK$23<>\"\",BB14,\"\")","v":""},{"$f":"IF($BK$23<>\"\",BC14,\"\")","v":""},null,null,{"$f":"IF($BK$23<>\"\",BC14,\"\")","v":""},{"$f":"IF($BK$23<>\"\",BB14,\"\")","v":""},null,"Rang",null,{"$f":"IF($BL$6<>\"\",IF($AV$10=$AY$10,IF($BU$22=$BW$22,\"?\",IF($BU$22=$BY$22,\"?\",RANK($BU$22,$BU$22:$BZ$22))),\"\"),\"\")","v":""},null,{"$f":"IF($BN$6<>\"\",IF($AV$10=$AY$10,IF($BW$22=$BU$22,\"?\",IF($BW$22=$BY$22,\"?\",RANK($BW$22,$BU$22:$BZ$22))),\"\"),\"\")","v":""},null,{"$f":"IF($BP$6<>\"\",IF($AV$10=$AY$10,IF($BY$22=$BU$22,\"?\",IF($BY$22=$BW$22,\"?\",RANK($BY$22,$BU$22:$BZ$22))),\"\"),\"\")","v":""},null,{"$f":"IF($BU$23<>\"\",SUM($CA$22:$CC$22),\"\")","v":""}]
[null,null,null,null,null,null,null,null,null,null,{"$f":"COUNT(K16:M23)","v":8},null,null,null,null,null,null,null,null,null,null,null,null,null,null,null,null,null,null,null,null,null,null,null,null,"     Parties Tour 4 C",null,null,null,null,null,null,null,null,null,null,null,{"$f":"IF(AND(C37<>\"\",E37<>\"\"),C37&\" - \"&E37,\"\")","v":"4 - 8"},{"$f":"IF(AB37<>\"\",1,0)","v":0},null,{"$f":"IF(F37=\"F\",1,0)","v":0},{"$f":"IF(T37=\"F\",1,0)","v":0},null,{"$f":"IF(AZ24=1,3,IF(U37<>\"\",COUNTIF(U37:Y37,\">=0\"),0))","v":0},{"$f":"IF(AY24=1,3,IF(U37<>\"\",COUNTIF(U37:Y37,\"<0\"),0))","v":0},null,{"$f":"IF(AY24=1,0,IF(AZ24=1,2,IF(BB24<>\"\",IF(BB24=3,2,IF(BC24=3,1,\"\")),\"\")))","v":""},{"$f":"IF(AZ24=1,0,IF(AY24=1,2,IF(BC24<>\"\",IF(BC24=3,2,IF(BB24=3,1,\"\")),\"\")))","v":""},null,null,null,null,{"$f":"IF($BN$21<>\"\",IF($BW$15=$BY$15,\"2 - 3\",\"\"),\"\")","v":""},null,null,{"$f":"IF($BK$24<>\"\",BB16,\"\")","v":""},{"$f":"IF($BK$24<>\"\",BC16,\"\")","v":""},{"$f":"IF($BK$24<>\"\",BC16,\"\")","v":""},{"$f":"IF($BK$24<>\"\",BB16,\"\")","v":""}]
["Table","Heure","Partie",null,null,"A/F (1)","Joueur 1",null,null,null,null,"contre",null,null,"Joueur 2",null,null,null,null,"A/F (1)","Scores",null,null,null,null,"Points parties",null,null,null,null,null,null,null,null,null,null,null,null,null,null,null,null,null,null,null,null,null,"2 - 3",0,null,0,0,null,0,0,null,"","",null,null,null,null,"Total",{"$f":"IF($BL$21<>\"\",(SUM($BL$22:$BL$24)/SUM($BM$22:$BM$24)),\"\")","v":""},null,{"$f":"IF($BN$21<>\"\",(SUM($BN$22:$BN$24)/SUM($BO$22:$BO$24)),\"\")","v":""},null,{"$f":"IF($BP$21<>\"\",(SUM($BP$22:$BP$24)/SUM($BQ$22:$BQ$24)),\"\")","v":""}]
[null,null,null,null,null,null,null,null,null,null,null,null,null,null,null,null,null,null,null,null,1,2,3,4,5,"J1","J2","J3","J4","J5","J6","J7","J8",null,null,null,null,null,null,null,null,null,null,null,null,null,null,"1 - 5",0,null,0,1,null,3,0,null,2,0]
[{"$f":"IF(Prépa!$X$6<>\"\",Prépa!$X$6,\"\")","v":1},{"$f":"IF(Prépa!$W$6<>\"\",Prépa!$W$6,\"\")","v":"9h30"},{"$f":"IF($K$16<>\"\",$A$16,\"\")","v":1},"-",{"$f":"IF($K$23<>\"\",$A$23,\"\")","v":8},null,{"$f":"IF($C27<>\"\",VLOOKUP($C27,$A$16:$J$23,2,FALSE),\"\")","v":"RUTLER Sébastien"},null,null,null,null,null,"-",{"$f":"IF($E27<>\"\",VLOOKUP($E27,$A$16:$J$23,2,FALSE),\"\")","v":"GOLLNISCH Laurent"},null,null,null,null,null,null,null,null,null,null,null,{"$f":"IF($AY14=1,0,IF($AZ14=1,2,IF($BB14<>\"\",IF($BB14=3,2,IF($BC14=3,1,\"\")),\"\")))","v":""},null,null,null,null,null,null,{"$f":"IF($AZ14=1,0,IF($AY14=1,2,IF($BC14<>\"\",IF($BC14=3,2,IF($BB14=3,1,\"\")),\"\")))","v":""},null,null,"     Parties Tour 5 C",null,null,null,null,null,null,null,null,null,null,null,"4 - 6",0,null,0,0,null,0,0,null,"","",null,null,null,null,"Départage aux points Niveau 1",null,null,null,null,null,null,null,"Clt après départage au points"]
[{"$f":"IF(Prépa!$X$7<>\"\",Prépa!$X$7,\"\")","v":2},{"$f":"IF(Prépa!$W$7<>\"\",Prépa!$W$7,\"\")","v":"9h30"},{"$f":"IF($K$17<>\"\",$A$17,\"\")","v":2},"-",{"$f":"IF($K$22<>\"\",$A$22,\"\")","v":7},null,{"$f":"IF($C28<>\"\",VLOOKUP($C28,$A$16:$J$23,2,FALSE),\"\")","v":"LE MOAL Bruno"},null,null,null,null,null,"-",{"$f":"IF($E28<>\"\",VLOOKUP($E28,$A$16:$J$23,2,FALSE),\"\")","v":"FILLOU Marie-Christine"},null,null,null,null,null,null,null,null,null,null,null,null,{"$f":"IF($AY15=1,0,IF($AZ15=1,2,IF($BB15<>\"\",IF($BB15=3,2,IF($BC15=3,1,\"\")),\"\")))","v":""},null,null,null,null,{"$f":"IF($AZ15=1,0,IF($AY15=1,2,IF($BC15<>\"\",IF($BC15=3,2,IF($BB15=3,1,\"\")),\"\")))","v":""},null,null,null,null,null,null,null,null,null,null,null,null,null,null,null,"3 - 7",0,null,0,0,null,0,0,null,"","",null,null,null,null,null,{"$f":"IF(AND($BU$23=\"?\",$CA$23=$CA$8),\"joueur 1\",\"\")","v":""},null,{"$f":"IF(AND($BW$23=\"?\",$CA$23=$CA$8),\"joueur 2\",\"\")","v":""},null,{"$f":"IF(AND($BY$23=\"?\",$CA$23=$CA$8),\"joueur 3\",\"\")","v":""},null,null,null,null,{"$f":"IF($K$16<>\"\",\"Joueur 1\",\"\")","v":"Joueur 1"},null,{"$f":"IF($K$17<>\"\",\"Joueur 2\",\"\")","v":"Joueur 2"},null,{"$f":"IF($K$18<>\"\",\"Joueur 3\",\"\")","v":"Joueur 3"}]
[{"$f":"IF(Prépa!$X$8<>\"\",Prépa!$X$8,\"\")","v":3},{"$f":"IF(Prépa!$W$8<>\"\",Prépa!$W$8,\"\")","v":"9h30"},{"$f":"IF($K$18<>\"\",$A$18,\"\")","v":3},"-",{"$f":"IF($K$21<>\"\",$A$21,\"\")","v":6},null,"PLET Victorien",null,null,null,null,null,"-","PIERROT Tristan",null,null,null,null,null,null,null,null,null,null,null,null,null,{"$f":"IF($AY16=1,0,IF($AZ16=1,2,IF($BB16<>\"\",IF($BB16=3,2,IF($BC16=3,1,\"\")),\"\")))","v":""},null,null,{"$f":"IF($AZ16=1,0,IF($AY16=1,2,IF($BC16<>\"\",IF($BC16=3,2,IF($BB16=3,1,\"\")),\"\")))","v":""},null,null,null,null,null,null,null,null,null,null,null,null,null,null,null,null,"2 - 8",0,null,0,0,null,0,0,null,"","",null,null,null,null,{"$f":"IF($BL$28<>\"\",IF($BU$22=$BW$22,\"1 - 2\",\"\"),\"\")","v":""},{"$f":"IF($BK$29<>\"\",$AZ$54,\"\")","v":""},{"$f":"IF($BK$29<>\"\",$BA$54,\"\")","v":""},{"$f":"IF($BK$29<>\"\",$BA$54,\"\")","v":""},{"$f":"IF($BK$29<>\"\",$AZ$54,\"\")","v":""},null,null,null,"Points",null,{"$f":"IF($BL$32=\"\",$BU$22,($BU$22+($BL$32*0.001)))","v":2},null,{"$f":"IF($BN$32=\"\",$BW$22,($BW$22+($BN$32*0.001)))","v":2},null,{"$f":"IF($BP$32=\"\",$BY$22,($BY$22+($BP$32*0.001)))","v":0},null,{"$f":"IF($BU$30=\"?\",COUNTIF($BU$29:$BZ$29,$BU$29),\"\")","v":""},{"$f":"IF($BW$30=\"?\",COUNTIF($BU$29:$BZ$29,$BW$29),\"\")","v":""},{"$f":"IF($BY$30=\"?\",COUNTIF($BU$23:$BZ$23,$BY$29),\"\")","v":""}]
[{"$f":"IF(Prépa!$X$9<>\"\",Prépa!$X$9,\"\")","v":4},{"$f":"IF(Prépa!$W$9<>\"\",Prépa!$W$9,\"\")","v":"9h30"},{"$f":"IF($K$19<>\"\",$A$19,\"\")","v":4},"-",{"$f":"IF($K$20<>\"\",$A$20,\"\")","v":5},null,"DEFRENEIX Samuel",null,null,null,null,null,"-","MANIER William",null,null,null,null,null,"F",null,null,null,null,null,null,null,null,{"$f":"IF($AY17=1,0,IF($AZ17=1,2,IF($BB17<>\"\",IF($BB17=3,2,IF($BC17=3,1,\"\")),\"\")))","v":2},{"$f":"IF($AZ17=1,0,IF($AY17=1,2,IF($BC17<>\"\",IF($BC17=3,2,IF($BB17=3,1,\"\")),\"\")))","v":0},null,null,null,null,null,"     Parties Tour 6 C",null,null,null,null,null,null,null,null,null,null,null,"1 - 4",0,null,0,0,null,0,0,null,"","",null,null,null,null,{"$f":"IF($BL$28<>\"\",IF($BU$22=$BY$22,\"1 - 3\",\"\"),\"\")","v":""},{"$f":"IF($BK$30<>\"\",AZ53,\"\")","v":""},{"$f":"IF($BK$30<>\"\",BA53,\"\")","v":""},null,null,{"$f":"IF($BK$30<>\"\",BA53,\"\")","v":""},{"$f":"IF($BK$30<>\"\",AZ53,\"\")","v":""},null,"Rang",null,{"$f":"IF($BL$6<>\"\",IF($AV$10=$AY$10,IF($BU$29=$BW$29,\"?\",IF($BU$29=$BY$29,\"?\",RANK($BU$29,$BU$29:$BZ$29))),\"\"),\"\")","v":""},null,{"$f":"IF($BN$6<>\"\",IF($AV$10=$AY$10,IF($BW$29=$BU$29,\"?\",IF($BW$29=$BY$29,\"?\",RANK($BW$29,$BU$29:$BZ$29))),\"\"),\"\")","v":""},null,{"$f":"IF($BP$6<>\"\",IF($AV$10=$AY$10,IF($BY$29=$BU$29,\"?\",IF($BY$29=$BW$29,\"?\",RANK($BY$29,$BU$29:$BZ$29))),\"\"),\"\")","v":""},null,{"$f":"IF($BU$30<>\"\",SUM($CA$29:$CC$29),\"\")","v":""}]
[{"$f":"IF(Prépa!$X$13<>\"\",Prépa!$X$13,\"\")","v":5},{"$f":"IF(Prépa!$W$13<>\"\",Prépa!$W$13,\"\")","v":"10h30"},{"$f":"IF($K$16<>\"\",$A$16,\"\")","v":1},"-",{"$f":"IF($K$22<>\"\",$A$22,\"\")","v":7},null,"RUTLER Sébastien",null,null,null,null,null,"-","FILLOU Marie-Christine",null,null,null,null,null,null,null,null,null,null,null,{"$f":"IF($AY18=1,0,IF($AZ18=1,2,IF($BB18<>\"\",IF($BB18=3,2,IF($BC18=3,1,\"\")),\"\")))","v":""},null,null,null,null,null,{"$f":"IF($AZ18=1,0,IF($AY18=1,2,IF($BC18<>\"\",IF($BC18=3,2,IF($BB18=3,1,\"\")),\"\")))","v":""},null,null,null,null,null,null,null,null,null,null,null,null,null,null,null,"3 - 5",1,null,0,1,null,3,0,null,2,0,null,null,null,null,{"$f":"IF($BN$28<>\"\",IF($BW$22=$BY$22,\"2 - 3\",\"\"),\"\")","v":""},null,null,{"$f":"IF($BK$31<>\"\",AZ55,\"\")","v":""},{"$f":"IF($BK$31<>\"\",BA55,\"\")","v":""},{"$f":"IF($BK$31<>\"\",BA55,\"\")","v":""},{"$f":"IF($BK$31<>\"\",AZ55,\"\")","v":""}]
[{"$f":"IF(Prépa!$X$14<>\"\",Prépa!$X$14,\"\")","v":6},{"$f":"IF(Prépa!$W$14<>\"\",Prépa!$W$14,\"\")","v":"10h30"},{"$f":"IF($K$21<>\"\",$A$21,\"\")","v":6},"-",{"$f":"IF($K$23<>\"\",$A$23,\"\")","v":8},null,"PIERROT Tristan",null,null,null,null,null,"-","GOLLNISCH Laurent",null,null,null,null,null,null,null,null,null,null,null,null,null,null,null,null,{"$f":"IF($AY19=1,0,IF($AZ19=1,2,IF($BB19<>\"\",IF($BB19=3,2,IF($BC19=3,1,\"\")),\"\")))","v":""},null,{"$f":"IF($AZ19=1,0,IF($AY19=1,2,IF($BC19<>\"\",IF($BC19=3,2,IF($BB19=3,1,\"\")),\"\")))","v":""},null,null,null,null,null,null,null,null,null,null,null,null,null,null,"2 - 6",0,null,0,0,null,0,0,null,"","",null,null,null,null,"Total",{"$f":"IF($BL$28<>\"\",(SUM($BL$29:$BL$31)/SUM($BM$29:$BM$31)),\"\")","v":""},null,{"$f":"IF($BN$28<>\"\",(SUM($BN$29:$BN$31)/SUM($BO$29:$BO$31)),\"\")","v":""},null,{"$f":"IF($BP$28<>\"\",(SUM($BP$29:$BP$31)/SUM($BQ$29:$BQ$31)),\"\")","v":""}]
[{"$f":"IF(Prépa!$X$15<>\"\",Prépa!$X$15,\"\")","v":7},{"$f":"IF(Prépa!$W$15<>\"\",Prépa!$W$15,\"\")","v":"10h30"},{"$f":"IF($K$17<>\"\",$A$17,\"\")","v":2},"-",{"$f":"IF($K$20<>\"\",$A$20,\"\")","v":5},null,"LE MOAL Bruno",null,null,null,null,null,"-","MANIER William",null,null,null,null,null,"F",null,null,null,null,null,null,{"$f":"IF($AY20=1,0,IF($AZ20=1,2,IF($BB20<>\"\",IF($BB20=3,2,IF($BC20=3,1,\"\")),\"\")))","v":2},null,null,{"$f":"IF($AZ20=1,0,IF($AY20=1,2,IF($BC20<>\"\",IF($BC20=3,2,IF($BB20=3,1,\"\")),\"\")))","v":0},null,null,null,null,null,"     Parties Tour 7 C",null,null,null,null,null,null,null,null,null,null,null,"7 - 8",0,null,0,0,null,0,0,null,"",""]
[{"$f":"IF(Prépa!$X$16<>\"\",Prépa!$X$16,\"\")","v":8},{"$f":"IF(Prépa!$W$16<>\"\",Prépa!$W$16,\"\")","v":"10h30"},{"$f":"IF($K$18<>\"\",$A$18,\"\")","v":3},"-",{"$f":"IF($K$19<>\"\",$A$19,\"\")","v":4},null,"PLET Victorien",null,null,null,null,null,"-","DEFRENEIX Samuel",null,null,null,null,null,null,null,null,null,null,null,null,null,{"$f":"IF($AY21=1,0,IF($AZ21=1,2,IF($BB21<>\"\",IF($BB21=3,2,IF($BC21=3,1,\"\")),\"\")))","v":""},{"$f":"IF($AZ21=1,0,IF($AY21=1,2,IF($BC21<>\"\",IF($BC21=3,2,IF($BB21=3,1,\"\")),\"\")))","v":""},null,null,null,null,null,null,null,null,null,null,null,null,null,null,null,null,null,null,{"$f":"IF(AND(C47<>\"\",E47<>\"\"),C47&\" - \"&E47,\"\")","v":"1 - 3"},{"$f":"IF(AB47<>\"\",1,0)","v":0},null,{"$f":"IF(F47=\"F\",1,0)","v":0},{"$f":"IF(T47=\"F\",1,0)","v":0},null,{"$f":"IF(AZ34=1,3,IF(U47<>\"\",COUNTIF(U47:Y47,\">=0\"),0))","v":0},{"$f":"IF(AY34=1,3,IF(U47<>\"\",COUNTIF(U47:Y47,\"<0\"),0))","v":0},null,{"$f":"IF(AY34=1,0,IF(AZ34=1,2,IF(BB34<>\"\",IF(BB34=3,2,IF(BC34=3,1,\"\")),\"\")))","v":""},{"$f":"IF(AZ34=1,0,IF(AY34=1,2,IF(BC34<>\"\",IF(BC34=3,2,IF(BB34=3,1,\"\")),\"\")))","v":""},null,null,null,null,null,"Classement après 3ème départage"]
[{"$f":"IF(Prépa!$X$20<>\"\",Prépa!$X$20,\"\")","v":2},{"$f":"IF(Prépa!$W$20<>\"\",Prépa!$W$20,\"\")","v":"11h30"},{"$f":"IF($K$16<>\"\",$A$16,\"\")","v":1},"-",{"$f":"IF($K$21<>\"\",$A$21,\"\")","v":6},null,"RUTLER Sébastien",null,null,null,null,null,"-","PIERROT Tristan",null,null,null,null,null,null,null,null,null,null,null,{"$f":"IF($AY22=1,0,IF($AZ22=1,2,IF($BB22<>\"\",IF($BB22=3,2,IF($BC22=3,1,\"\")),\"\")))","v":""},null,null,null,null,{"$f":"IF($AZ22=1,0,IF($AY22=1,2,IF($BC22<>\"\",IF($BC22=3,2,IF($BB22=3,1,\"\")),\"\")))","v":""},null,null,null,null,null,null,null,null,null,null,null,null,null,null,null,null,"2 - 4",0,null,0,0,null,0,0,null,"","",null,null,null,null,null,"Joueur 1",null,"Joueur 2",null,"Joueur 3"]
[{"$f":"IF(Prépa!$X$21<>\"\",Prépa!$X$21,\"\")","v":3},{"$f":"IF(Prépa!$W$21<>\"\",Prépa!$W$21,\"\")","v":"11h30"},{"$f":"IF($K$20<>\"\",$A$20,\"\")","v":5},"-",{"$f":"IF($K$22<>\"\",$A$22,\"\")","v":7},"F","MANIER William",null,null,null,null,null,"-","FILLOU Marie-Christine",null,null,null,null,null,null,null,null,null,null,null,null,null,null,null,{"$f":"IF($AY23=1,0,IF($AZ23=1,2,IF($BB23<>\"\",IF($BB23=3,2,IF($BC23=3,1,\"\")),\"\")))","v":0},null,{"$f":"IF($AZ23=1,0,IF($AY23=1,2,IF($BC23<>\"\",IF($BC23=3,2,IF($BB23=3,1,\"\")),\"\")))","v":2},null,null,null,null,1,null,null,null,null,null,null,null,null,null,null,"5 - 8",0,null,1,0,null,0,3,null,0,2,null,null,null,null,null,{"$f":"IF($BU$29<>\"\",$BU$29,\"\")","v":2},null,{"$f":"IF($BW$29<>\"\",$BW$29,\"\")","v":2},null,{"$f":"IF($BY$29<>\"\",$BY$29,\"\")","v":0}]
[{"$f":"IF(Prépa!$X$22<>\"\",Prépa!$X$22,\"\")","v":4},{"$f":"IF(Prépa!$W$22<>\"\",Prépa!$W$22,\"\")","v":"11h30"},{"$f":"IF($K$19<>\"\",$A$19,\"\")","v":4},"-",{"$f":"IF($K$23<>\"\",$A$23,\"\")","v":8},null,"DEFRENEIX Samuel",null,null,null,null,null,"-","GOLLNISCH Laurent",null,null,null,null,null,null,null,null,null,null,null,null,null,null,{"$f":"IF($AY24=1,0,IF($AZ24=1,2,IF($BB24<>\"\",IF($BB24=3,2,IF($BC24=3,1,\"\")),\"\")))","v":""},null,null,null,{"$f":"IF($AZ24=1,0,IF($AY24=1,2,IF($BC24<>\"\",IF($BC24=3,2,IF($BB24=3,1,\"\")),\"\")))","v":""},null,null,null,null,null,null,null,null,null,null,null,null,null,null,"6 - 7",0,null,0,0,null,0,0,null,"","",null,null,null,null,null,{"$f":"IF($BU$30<>\"\",$BU$30,\"\")","v":""},null,{"$f":"IF($BW$30<>\"\",$BW$30,\"\")","v":""},null,{"$f":"IF($BY$30<>\"\",$BY$30,\"\")","v":""}]
[{"$f":"IF(Prépa!$X$23<>\"\",Prépa!$X$23,\"\")","v":1},{"$f":"IF(Prépa!$W$23<>\"\",Prépa!$W$23,\"\")","v":"11h30"},{"$f":"IF($K$17<>\"\",$A$17,\"\")","v":2},"-",{"$f":"IF($K$18<>\"\",$A$18,\"\")","v":3},null,"LE MOAL Bruno",null,null,null,null,null,"-","PLET Victorien",null,null,null,null,null,null,null,null,null,null,null,null,{"$f":"IF($AY25=1,0,IF($AZ25=1,2,IF($BB25<>\"\",IF($BB25=3,2,IF($BC25=3,1,\"\")),\"\")))","v":""},{"$f":"IF($AZ25=1,0,IF($AY25=1,2,IF($BC25<>\"\",IF($BC25=3,2,IF($BB25=3,1,\"\")),\"\")))","v":""},null,null,null,null,null,null,null,null,"    Débloquer C",null,null,null,null,null,null,null,null,null,null,"1 - 2",0,null,0,0,null,0,0,null,"",""]
[{"$f":"IF(Prépa!$X$27<>\"\",Prépa!$X$27,\"\")","v":6},{"$f":"IF(Prépa!$W$27<>\"\",Prépa!$W$27,\"\")","v":"13h30"},{"$f":"IF($K$16<>\"\",$A$16,\"\")","v":1},"-",{"$f":"IF($K$20<>\"\",$A$20,\"\")","v":5},null,"RUTLER Sébastien",null,null,null,null,null,"-","MANIER William",null,null,null,null,null,"F",null,null,null,null,null,{"$f":"IF($AY26=1,0,IF($AZ26=1,2,IF($BB26<>\"\",IF($BB26=3,2,IF($BC26=3,1,\"\")),\"\")))","v":2},null,null,null,{"$f":"IF($AZ26=1,0,IF($AY26=1,2,IF($BC26<>\"\",IF($BC26=3,2,IF($BB26=3,1,\"\")),\"\")))","v":0},null,null,null,null,null,null,null,null,null,null,null,null,null,null,null,null,null,"3 - 8",0,null,0,0,null,0,0,null,"",""]
[{"$f":"IF(Prépa!$X$28<>\"\",Prépa!$X$28,\"\")","v":7},{"$f":"IF(Prépa!$W$28<>\"\",Prépa!$W$28,\"\")","v":"13h30"},{"$f":"IF($K$19<>\"\",$A$19,\"\")","v":4},"-",{"$f":"IF($K$21<>\"\",$A$21,\"\")","v":6},null,"DEFRENEIX Samuel",null,null,null,null,null,"-","PIERROT Tristan",null,null,null,null,null,null,null,null,null,null,null,null,null,null,{"$f":"IF($AY27=1,0,IF($AZ27=1,2,IF($BB27<>\"\",IF($BB27=3,2,IF($BC27=3,1,\"\")),\"\")))","v":""},null,{"$f":"IF($AZ27=1,0,IF($AY27=1,2,IF($BC27<>\"\",IF($BC27=3,2,IF($BB27=3,1,\"\")),\"\")))","v":""},null,null,null,null,null,null,null,null,null,null,null,null,null,null,null,null,"4 - 7",0,null,0,0,null,0,0,null,"",""]
[{"$f":"IF(Prépa!$X$29<>\"\",Prépa!$X$29,\"\")","v":8},{"$f":"IF(Prépa!$W$29<>\"\",Prépa!$W$29,\"\")","v":"13h30"},{"$f":"IF($K$18<>\"\",$A$18,\"\")","v":3},"-",{"$f":"IF($K$22<>\"\",$A$22,\"\")","v":7},null,"PLET Victorien",null,null,null,null,null,"-","FILLOU Marie-Christine",null,null,null,null,null,null,null,null,null,null,null,null,null,{"$f":"IF($AY28=1,0,IF($AZ28=1,2,IF($BB28<>\"\",IF($BB28=3,2,IF($BC28=3,1,\"\")),\"\")))","v":""},null,null,null,{"$f":"IF($AZ28=1,0,IF($AY28=1,2,IF($BC28<>\"\",IF($BC28=3,2,IF($BB28=3,1,\"\")),\"\")))","v":""},null,null,null,null,"   RAZ C",null,null,null,null,null,null,null,null,null,null,"5 - 6",0,null,1,0,null,0,3,null,0,2]
[{"$f":"IF(Prépa!$X$30<>\"\",Prépa!$X$30,\"\")","v":5},{"$f":"IF(Prépa!$W$30<>\"\",Prépa!$W$30,\"\")","v":"13h30"},{"$f":"IF($K$17<>\"\",$A$17,\"\")","v":2},"-",{"$f":"IF($K$23<>\"\",$A$23,\"\")","v":8},null,"LE MOAL Bruno",null,null,null,null,null,"-","GOLLNISCH Laurent",null,null,null,null,null,null,null,null,null,null,null,null,{"$f":"IF($AY29=1,0,IF($AZ29=1,2,IF($BB29<>\"\",IF($BB29=3,2,IF($BC29=3,1,\"\")),\"\")))","v":""},null,null,null,null,null,{"$f":"IF($AZ29=1,0,IF($AY29=1,2,IF($BC29<>\"\",IF($BC29=3,2,IF($BB29=3,1,\"\")),\"\")))","v":""}]
[{"$f":"IF(Prépa!$X$34<>\"\",Prépa!$X$34,\"\")","v":3},{"$f":"IF(Prépa!$W$34<>\"\",Prépa!$W$34,\"\")","v":"14h30"},{"$f":"IF($K$16<>\"\",$A$16,\"\")","v":1},"-",{"$f":"IF($K$19<>\"\",$A$19,\"\")","v":4},null,"RUTLER Sébastien",null,null,null,null,null,"-","DEFRENEIX Samuel",null,null,null,null,null,null,null,null,null,null,null,{"$f":"IF($AY30=1,0,IF($AZ30=1,2,IF($BB30<>\"\",IF($BB30=3,2,IF($BC30=3,1,\"\")),\"\")))","v":""},null,null,{"$f":"IF($AZ30=1,0,IF($AY30=1,2,IF($BC30<>\"\",IF($BC30=3,2,IF($BB30=3,1,\"\")),\"\")))","v":""}]
[{"$f":"IF(Prépa!$X$35<>\"\",Prépa!$X$35,\"\")","v":4},{"$f":"IF(Prépa!$W$35<>\"\",Prépa!$W$35,\"\")","v":"14h30"},{"$f":"IF($K$18<>\"\",$A$18,\"\")","v":3},"-",{"$f":"IF($K$20<>\"\",$A$20,\"\")","v":5},null,"PLET Victorien",null,null,null,null,null,"-","MANIER William",null,null,null,null,null,"F",null,null,null,null,null,null,null,{"$f":"IF($AY31=1,0,IF($AZ31=1,2,IF($BB31<>\"\",IF($BB31=3,2,IF($BC31=3,1,\"\")),\"\")))","v":2},null,{"$f":"IF($AZ31=1,0,IF($AY31=1,2,IF($BC31<>\"\",IF($BC31=3,2,IF($BB31=3,1,\"\")),\"\")))","v":0}]
[{"$f":"IF(Prépa!$X$36<>\"\",Prépa!$X$36,\"\")","v":1},{"$f":"IF(Prépa!$W$36<>\"\",Prépa!$W$36,\"\")","v":"14h30"},{"$f":"IF($K$17<>\"\",$A$17,\"\")","v":2},"-",{"$f":"IF($K$21<>\"\",$A$21,\"\")","v":6},null,"LE MOAL Bruno",null,null,null,null,null,"-","PIERROT Tristan",null,null,null,null,null,null,null,null,null,null,null,null,{"$f":"IF($AY32=1,0,IF($AZ32=1,2,IF($BB32<>\"\",IF($BB32=3,2,IF($BC32=3,1,\"\")),\"\")))","v":""},null,null,null,{"$f":"IF($AZ32=1,0,IF($AY32=1,2,IF($BC32<>\"\",IF($BC32=3,2,IF($BB32=3,1,\"\")),\"\")))","v":""},null,null,null,null,null,null,null,null,null,null,null,null,null,null,null,null,"Points"]
[{"$f":"IF(Prépa!$X$37<>\"\",Prépa!$X$37,\"\")","v":2},{"$f":"IF(Prépa!$W$37<>\"\",Prépa!$W$37,\"\")","v":"14h30"},{"$f":"IF($K$22<>\"\",$A$22,\"\")","v":7},"-",{"$f":"IF($K$23<>\"\",$A$23,\"\")","v":8},null,"FILLOU Marie-Christine",null,null,null,null,null,"-","GOLLNISCH Laurent",null,null,null,null,null,null,null,null,null,null,null,null,null,null,null,null,null,{"$f":"IF($AY33=1,0,IF($AZ33=1,2,IF($BB33<>\"\",IF($BB33=3,2,IF($BC33=3,1,\"\")),\"\")))","v":""},{"$f":"IF($AZ33=1,0,IF($AY33=1,2,IF($BC33<>\"\",IF($BC33=3,2,IF($BB33=3,1,\"\")),\"\")))","v":""},null,null,null,null,null,null,null,null,null,null,null,null,null,null,"Manche 1",null,"Manche 2",null,"Manche 3",null,"Manche 4",null,"Manche 5",null,"J1","J2"]
[{"$f":"IF(Prépa!$X$41<>\"\",Prépa!$X$41,\"\")","v":7},{"$f":"IF(Prépa!$W$41<>\"\",Prépa!$W$41,\"\")","v":"15h30"},{"$f":"IF($K$16<>\"\",$A$16,\"\")","v":1},"-",{"$f":"IF($K$18<>\"\",$A$18,\"\")","v":3},null,"RUTLER Sébastien",null,null,null,null,null,"-","PLET Victorien",null,null,null,null,null,null,null,null,null,null,null,{"$f":"IF($AY34=1,0,IF($AZ34=1,2,IF($BB34<>\"\",IF($BB34=3,2,IF($BC34=3,1,\"\")),\"\")))","v":""},null,{"$f":"IF($AZ34=1,0,IF($AY34=1,2,IF($BC34<>\"\",IF($BC34=3,2,IF($BB34=3,1,\"\")),\"\")))","v":""},null,null,null,null,null,null,null,null,null,null,null,null,null,null,null,null,null,null,null,{"$f":"IF(AND($AZ$14=1,$U$27=\"\"),11,IF($U$27<0.1,-$U$27,IF(AND($U$27>-0.1,$U$27<10),11,($U$27+2))))","v":0},{"$f":"IF(AND($AY$14=1,$U$27=\"\"),11,IF($U$27>-0.1,$U$27,IF(AND($U$27<0.1,$U$27>-10),11,(-$U$27+2))))","v":0},{"$f":"IF(AND($AZ$14=1,$V$27=\"\"),11,IF($V$27<0.1,-$V$27,IF(AND($V$27>-0.1,$V$27<10),11,($V$27+2))))","v":0},{"$f":"IF(AND($AY$14=1,$V$27=\"\"),11,IF($V$27>-0.1,$V$27,IF(AND($V$27<0.1,$V$27>-10),11,(-$V$27+2))))","v":0},{"$f":"IF(AND($AZ$14=1,$W$27=\"\"),11,IF($W$27<0.1,-$W$27,IF(AND($W$27>-0.1,$W$27<10),11,($W$27+2))))","v":0},{"$f":"IF(AND($AY$14=1,$W$27=\"\"),11,IF($W$27>-0.1,$W$27,IF(AND($W$27<0.1,$W$27>-10),11,(-$W$27+2))))","v":0},{"$f":"IF(AND($AZ$14=1,$X$27=\"\"),11,IF($X$27<0.1,-$X$27,IF(AND($X$27>-0.1,$X$27<10),11,($X$27+2))))","v":0},{"$f":"IF(AND($AY$14=1,$X$27=\"\"),11,IF($X$27>-0.1,$X$27,IF(AND($X$27<0.1,$X$27>-10),11,(-$X$27+2))))","v":0},{"$f":"IF(AND($AZ$14=1,$Y$27=\"\"),11,IF($Y$27<0.1,-$Y$27,IF(AND($Y$27>-0.1,$Y$27<10),11,($Y$27+2))))","v":0},{"$f":"IF(AND($AY$14=1,$Y$27=\"\"),11,IF($Y$27>-0.1,$Y$27,IF(AND($Y$27<0.1,$Y$27>-10),11,(-$Y$27+2))))","v":0},{"$f":"IF($BB$14+$BC$14>2,IF($BB$14+$BC$14=3,$AV$47+$AX$47+$AZ$47,IF($BB$14+$BC$14=4,$AV$47+$AX$47+$AZ$47+$BB$47,IF($BB$14+$BC$14=5,$AV$47+$AX$47+$AZ$47+$BB$47+$BD$47,\"\"))),\"\")","v":""},{"$f":"IF($BB$14+$BC$14>2,IF($BB$14+$BC$14=3,$AW$47+$AY$47+$BA$47,IF($BB$14+$BC$14=4,$AW$47+$AY$47+$BA$47+$BC$47,IF($BB$14+$BC$14=5,$AW$47+$AY$47+$BA$47+$BC$47+$BE$47,\"\"))),\"\")","v":""}]
[{"$f":"IF(Prépa!$X$42<>\"\",Prépa!$X$42,\"\")","v":8},{"$f":"IF(Prépa!$W$42<>\"\",Prépa!$W$42,\"\")","v":"15h30"},{"$f":"IF($K$17<>\"\",$A$17,\"\")","v":2},"-",{"$f":"IF($K$19<>\"\",$A$19,\"\")","v":4},null,"LE MOAL Bruno",null,null,null,null,null,"-","DEFRENEIX Samuel",null,null,null,null,null,null,null,null,null,null,null,null,{"$f":"IF($AY35=1,0,IF($AZ35=1,2,IF($BB35<>\"\",IF($BB35=3,2,IF($BC35=3,1,\"\")),\"\")))","v":""},null,{"$f":"IF($AZ35=1,0,IF($AY35=1,2,IF($BC35<>\"\",IF($BC35=3,2,IF($BB35=3,1,\"\")),\"\")))","v":""},null,null,null,null,null,null,null,null,null,null,null,null,null,null,null,null,null,null,{"$f":"IF(AND($AZ$15=1,$U$28=\"\"),11,IF($U$28<0.1,-$U$28,IF(AND($U$28>-0.1,$U$28<10),11,($U$28+2))))","v":0},{"$f":"IF(AND($AY$15=1,$U$28=\"\"),11,IF($U$28>-0.1,$U$28,IF(AND($U$28<0.1,$U$28>-10),11,(-$U$28+2))))","v":0},{"$f":"IF(AND($AZ$15=1,$V$28=\"\"),11,IF($V$28<0.1,-$V$28,IF(AND($V$28>-0.1,$V$28<10),11,($V$28+2))))","v":0},{"$f":"IF(AND($AY$15=1,$V$28=\"\"),11,IF($V$28>-0.1,$V$28,IF(AND($V$28<0.1,$V$28>-10),11,(-$V$28+2))))","v":0},{"$f":"IF(AND($AZ$15=1,$W$28=\"\"),11,IF($W$28<0.1,-$W$28,IF(AND($W$28>-0.1,$W$28<10),11,($W$28+2))))","v":0},{"$f":"IF(AND($AY$15=1,$W$28=\"\"),11,IF($W$28>-0.1,$W$28,IF(AND($W$28<0.1,$W$28>-10),11,(-$W$28+2))))","v":0},{"$f":"IF(AND($AZ$15=1,$X$28=\"\"),11,IF($X$28<0.1,-$X$28,IF(AND($X$28>-0.1,$X$28<10),11,($X$28+2))))","v":0},{"$f":"IF(AND($AY$15=1,$X$28=\"\"),11,IF($X$28>-0.1,$X$28,IF(AND($X$28<0.1,$X$28>-10),11,(-$X$28+2))))","v":0},{"$f":"IF(AND($AZ$15=1,$Y$28=\"\"),11,IF($Y$28<0.1,-$Y$28,IF(AND($Y$28>-0.1,$Y$28<10),11,($Y$28+2))))","v":0},{"$f":"IF(AND($AY$15=1,$Y$28=\"\"),11,IF($Y$28>-0.1,$Y$28,IF(AND($Y$28<0.1,$Y$28>-10),11,(-$Y$28+2))))","v":0},{"$f":"IF($BB$15+$BC$15>2,IF($BB$15+$BC$15=3,$AV$48+$AX$48+$AZ$48,IF($BB$15+$BC$15=4,$AV$48+$AX$48+$AZ$48+$BB$48,IF($BB$15+$BC$15=5,$AV$48+$AX$48+$AZ$48+$BB$48+$BD$48,\"\"))),\"\")","v":""},{"$f":"IF($BB$15+$BC$15>2,IF($BB$15+$BC$15=3,$AW$48+$AY$48+$BA$48,IF($BB$15+$BC$15=4,$AW$48+$AY$48+$BA$48+$BC$48,IF($BB$15+$BC$15=5,$AW$48+$AY$48+$BA$48+$BC$48+$BE$48,\"\"))),\"\")","v":""}]
[{"$f":"IF(Prépa!$X$43<>\"\",Prépa!$X$43,\"\")","v":5},{"$f":"IF(Prépa!$W$43<>\"\",Prépa!$W$43,\"\")","v":"15h30"},{"$f":"IF($K$20<>\"\",$A$20,\"\")","v":5},"-",{"$f":"IF($K$23<>\"\",$A$23,\"\")","v":8},"F","MANIER William",null,null,null,null,null,"-","GOLLNISCH Laurent",null,null,null,null,null,null,null,null,null,null,null,null,null,null,null,{"$f":"IF($AY36=1,0,IF($AZ36=1,2,IF($BB36<>\"\",IF($BB36=3,2,IF($BC36=3,1,\"\")),\"\")))","v":0},null,null,{"$f":"IF($AZ36=1,0,IF($AY36=1,2,IF($BC36<>\"\",IF($BC36=3,2,IF($BB36=3,1,\"\")),\"\")))","v":2},null,null,null,null,null,null,null,null,null,null,null,null,null,null,{"$f":"IF(AND($AZ$16=1,$U$29=\"\"),11,IF($U$29<0.1,-$U$29,IF(AND($U$29>-0.1,$U$29<10),11,($U$29+2))))","v":0},{"$f":"IF(AND($AY$16=1,$U$29=\"\"),11,IF($U$29>-0.1,$U$29,IF(AND($U$29<0.1,$U$29>-10),11,(-$U$29+2))))","v":0},{"$f":"IF(AND($AZ$16=1,$V$29=\"\"),11,IF($V$29<0.1,-$V$29,IF(AND($V$29>-0.1,$V$29<10),11,($V$29+2))))","v":0},{"$f":"IF(AND($AY$16=1,$V$29=\"\"),11,IF($V$29>-0.1,$V$29,IF(AND($V$29<0.1,$V$29>-10),11,(-$V$29+2))))","v":0},{"$f":"IF(AND($AZ$16=1,$W$29=\"\"),11,IF($W$29<0.1,-$W$29,IF(AND($W$29>-0.1,$W$29<10),11,($W$29+2))))","v":0},{"$f":"IF(AND($AY$16=1,$W$29=\"\"),11,IF($W$29>-0.1,$W$29,IF(AND($W$29<0.1,$W$29>-10),11,(-$W$29+2))))","v":0},{"$f":"IF(AND($AZ$16=1,$X$29=\"\"),11,IF($X$29<0.1,-$X$29,IF(AND($X$29>-0.1,$X$29<10),11,($X$29+2))))","v":0},{"$f":"IF(AND($AY$16=1,$X$29=\"\"),11,IF($X$29>-0.1,$X$29,IF(AND($X$29<0.1,$X$29>-10),11,(-$X$29+2))))","v":0},{"$f":"IF(AND($AZ$16=1,$Y$29=\"\"),11,IF($Y$29<0.1,-$Y$29,IF(AND($Y$29>-0.1,$Y$29<10),11,($Y$29+2))))","v":0},{"$f":"IF(AND($AY$16=1,$Y$29=\"\"),11,IF($Y$29>-0.1,$Y$29,IF(AND($Y$29<0.1,$Y$29>-10),11,(-$Y$29+2))))","v":0},{"$f":"IF($BB$16+$BC$16>2,IF($BB$16+$BC$16=3,$AV$49+$AX$49+$AZ$49,IF($BB$16+$BC$16=4,$AV$49+$AX$49+$AZ$49+$BB$49,IF($BB$16+$BC$16=5,$AV$49+$AX$49+$AZ$49+$BB$49+$BD$49,\"\"))),\"\")","v":""},{"$f":"IF($BB$16+$BC$16>2,IF($BB$16+$BC$16=3,$AW$49+$AY$49+$BA$49,IF($BB$16+$BC$16=4,$AW$49+$AY$49+$BA$49+$BC$49,IF($BB$16+$BC$16=5,$AW$49+$AY$49+$BA$49+$BC$49+$BE$49,\"\"))),\"\")","v":""}]
[{"$f":"IF(Prépa!$X$44<>\"\",Prépa!$X$44,\"\")","v":6},{"$f":"IF(Prépa!$W$44<>\"\",Prépa!$W$44,\"\")","v":"15h30"},{"$f":"IF($K$21<>\"\",$A$21,\"\")","v":6},"-",{"$f":"IF($K$22<>\"\",$A$22,\"\")","v":7},null,"PIERROT Tristan",null,null,null,null,null,"-","FILLOU Marie-Christine",null,null,null,null,null,null,null,null,null,null,null,null,null,null,null,null,{"$f":"IF($AY37=1,0,IF($AZ37=1,2,IF($BB37<>\"\",IF($BB37=3,2,IF($BC37=3,1,\"\")),\"\")))","v":""},{"$f":"IF($AZ37=1,0,IF($AY37=1,2,IF($BC37<>\"\",IF($BC37=3,2,IF($BB37=3,1,\"\")),\"\")))","v":""}]
[{"$f":"IF(Prépa!$X$48<>\"\",Prépa!$X$48,\"\")","v":1},{"$f":"IF(Prépa!$W$48<>\"\",Prépa!$W$48,\"\")","v":"16h30"},{"$f":"IF($K$16<>\"\",$A$16,\"\")","v":1},"-",{"$f":"IF($K$17<>\"\",$A$17,\"\")","v":2},null,"RUTLER Sébastien",null,null,null,null,null,"-","LE MOAL Bruno",null,null,null,null,null,null,null,null,null,null,null,{"$f":"IF($AY38=1,0,IF($AZ38=1,2,IF($BB38<>\"\",IF($BB38=3,2,IF($BC38=3,1,\"\")),\"\")))","v":""},{"$f":"IF($AZ38=1,0,IF($AY38=1,2,IF($BC38<>\"\",IF($BC38=3,2,IF($BB38=3,1,\"\")),\"\")))","v":""},null,null,null,null,null,null,null,null,null,null,null,null,null,null,null,null,null,null,null,null,"Points"]
[{"$f":"IF(Prépa!$X$49<>\"\",Prépa!$X$49,\"\")","v":2},{"$f":"IF(Prépa!$W$49<>\"\",Prépa!$W$49,\"\")","v":"16h30"},{"$f":"IF($K$18<>\"\",$A$18,\"\")","v":3},"-",{"$f":"IF($K$23<>\"\",$A$23,\"\")","v":8},null,"PLET Victorien",null,null,null,null,null,"-","GOLLNISCH Laurent",null,null,null,null,null,null,null,null,null,null,null,null,null,{"$f":"IF($AY39=1,0,IF($AZ39=1,2,IF($BB39<>\"\",IF($BB39=3,2,IF($BC39=3,1,\"\")),\"\")))","v":""},null,null,null,null,{"$f":"IF($AZ39=1,0,IF($AY39=1,2,IF($BC39<>\"\",IF($BC39=3,2,IF($BB39=3,1,\"\")),\"\")))","v":""},null,null,null,null,null,null,null,null,null,null,null,null,null,null,"Manche 6",null,"Manche 7",null,"J1","J2"]
[{"$f":"IF(Prépa!$X$50<>\"\",Prépa!$X$50,\"\")","v":3},{"$f":"IF(Prépa!$W$50<>\"\",Prépa!$W$50,\"\")","v":"16h30"},{"$f":"IF($K$19<>\"\",$A$19,\"\")","v":4},"-",{"$f":"IF($K$22<>\"\",$A$22,\"\")","v":7},null,"DEFRENEIX Samuel",null,null,null,null,null,"-","FILLOU Marie-Christine",null,null,null,null,null,null,null,null,null,null,null,null,null,null,{"$f":"IF($AY40=1,0,IF($AZ40=1,2,IF($BB40<>\"\",IF($BB40=3,2,IF($BC40=3,1,\"\")),\"\")))","v":""},null,null,{"$f":"IF($AZ40=1,0,IF($AY40=1,2,IF($BC40<>\"\",IF($BC40=3,2,IF($BB40=3,1,\"\")),\"\")))","v":""},null,null,null,null,null,null,null,null,null,null,null,null,null,null,null,{"$f":"IF(AND($AZ$14=1,#REF!=\"\"),11,IF(#REF!<0.1,-#REF!,IF(AND(#REF!>-0.1,#REF!<10),11,(#REF!+2))))","v":{"$error":"#REF!"}},{"$f":"IF(AND($AY$14=1,#REF!=\"\"),11,IF(#REF!>-0.1,#REF!,IF(AND(#REF!<0.1,#REF!>-10),11,(-#REF!+2))))","v":{"$error":"#REF!"}},{"$f":"IF(AND($AZ$14=1,#REF!=\"\"),11,IF(#REF!<0.1,-#REF!,IF(AND(#REF!>-0.1,#REF!<10),11,(#REF!+2))))","v":{"$error":"#REF!"}},{"$f":"IF(AND($AY$14=1,#REF!=\"\"),11,IF(#REF!>-0.1,#REF!,IF(AND(#REF!<0.1,#REF!>-10),11,(-#REF!+2))))","v":{"$error":"#REF!"}},{"$f":"IF($BB$14+$BC$14>2,IF($BB$14+$BC$14=3,$AV$47+$AX$47+$AZ$47,IF($BB$14+$BC$14=4,$AV$47+$AX$47+$AZ$47+$BB$47,IF($BB$14+$BC$14=5,$AV$47+$AX$47+$AZ$47+$BB$47+$BD$47,IF($BB$14+$BC$14=6,$AV$47+$AX$47+$AZ$47+$BB$47+$BD$47+$AV$53,IF($BB$14+$BC$14=7,$AV$47+$AX$47+$AZ$47+$BB$47+$BD$47+$AV$53+$AX$53,\"\"))))),\"\")","v":""},{"$f":"IF($BB$14+$BC$14>2,IF($BB$14+$BC$14=3,$AW$47+$AY$47+$BA$47,IF($BB$14+$BC$14=4,$AW$47+$AY$47+$BA$47+$BC$47,IF($BB$14+$BC$14=5,$AW$47+$AY$47+$BA$47+$BC$47+$BE$47,IF($BB$14+$BC$14=6,$AW$47+$AY$47+$BA$47+$BC$47+$BE$47+$AW$53,IF($BB$14+$BC$14=7,$AW$47+$AY$47+$BA$47+$BC$47+$BE$47+$AW$53+$AY$53,\"\"))))),\"\")","v":""}]
[{"$f":"IF(Prépa!$X$51<>\"\",Prépa!$X$51,\"\")","v":4},{"$f":"IF(Prépa!$W$51<>\"\",Prépa!$W$51,\"\")","v":"16h30"},{"$f":"IF($K$20<>\"\",$A$20,\"\")","v":5},"-",{"$f":"IF($K$21<>\"\",$A$21,\"\")","v":6},"F","MANIER William",null,null,null,null,null,"-","PIERROT Tristan",null,null,null,null,null,null,null,null,null,null,null,null,null,null,null,{"$f":"IF($AY41=1,0,IF($AZ41=1,2,IF($BB41<>\"\",IF($BB41=3,2,IF($BC41=3,1,\"\")),\"\")))","v":0},{"$f":"IF($AZ41=1,0,IF($AY41=1,2,IF($BC41<>\"\",IF($BC41=3,2,IF($BB41=3,1,\"\")),\"\")))","v":2},null,null,null,null,null,null,null,null,null,null,null,null,null,null,null,null,{"$f":"IF(AND($AZ$15=1,#REF!=\"\"),11,IF(#REF!<0.1,-#REF!,IF(AND(#REF!>-0.1,#REF!<10),11,(#REF!+2))))","v":{"$error":"#REF!"}},{"$f":"IF(AND($AY$15=1,#REF!=\"\"),11,IF(#REF!>-0.1,#REF!,IF(AND(#REF!<0.1,#REF!>-10),11,(-#REF!+2))))","v":{"$error":"#REF!"}},{"$f":"IF(AND($AZ$15=1,#REF!=\"\"),11,IF(#REF!<0.1,-#REF!,IF(AND(#REF!>-0.1,#REF!<10),11,(#REF!+2))))","v":{"$error":"#REF!"}},{"$f":"IF(AND($AY$15=1,#REF!=\"\"),11,IF(#REF!>-0.1,#REF!,IF(AND(#REF!<0.1,#REF!>-10),11,(-#REF!+2))))","v":{"$error":"#REF!"}},{"$f":"IF($BB$15+$BC$15>2,IF($BB$15+$BC$15=3,$AV$48+$AX$48+$AZ$48,IF($BB$15+$BC$15=4,$AV$48+$AX$48+$AZ$48+$BB$48,IF($BB$15+$BC$15=5,$AV$48+$AX$48+$AZ$48+$BB$48+$BD$48,IF($BB$15+$BC$15=6,$AV$48+$AX$48+$AZ$48+$BB$48+$BD$48+$AV$54,IF($BB$15+$BC$15=7,$AV$48+$AX$48+$AZ$48+$BB$48+$BD$48+$AV$54+$AX$54,\"\"))))),\"\")","v":""},{"$f":"IF($BB$15+$BC$15>2,IF($BB$15+$BC$15=3,$AW$48+$AY$48+$BA$48,IF($BB$15+$BC$15=4,$AW$48+$AY$48+$BA$48+$BC$48,IF($BB$15+$BC$15=5,$AW$48+$AY$48+$BA$48+$BC$48+$BE$48,IF($BB$15+$BC$15=6,$AW$48+$AY$48+$BA$48+$BC$48+$BE$48+$AW$54,IF($BB$15+$BC$15=7,$AW$48+$AY$48+$BA$48+$BC$48+$BE$48+$AW$54+$AY$54,\"\"))))),\"\")","v":""}]
["(1)  A = Abandon ou disqualification en cours de partie\n      F = Forfait, disqualification en dehors d’une partie ou refus de jouer",null,null,null,null,null,null,null,null,null,null,null,null,null,null,null,null,null,null,null,"Total points parties : ",null,null,null,null,{"$f":"IF(Z57>0,SUM(Z27:Z54),\"\")","v":2},{"$f":"IF(AA57>0,SUM(AA27:AA54),\"\")","v":2},2,2,0,2,2,{"$f":"IF(AG57>0,SUM(AG27:AG54),\"\")","v":2},null,null,null,null,null,null,null,null,null,null,null,null,null,null,{"$f":"IF(AND($AZ$16=1,#REF!=\"\"),11,IF(#REF!<0.1,-#REF!,IF(AND(#REF!>-0.1,#REF!<10),11,(#REF!+2))))","v":{"$error":"#REF!"}},{"$f":"IF(AND($AY$16=1,#REF!=\"\"),11,IF(#REF!>-0.1,#REF!,IF(AND(#REF!<0.1,#REF!>-10),11,(-#REF!+2))))","v":{"$error":"#REF!"}},{"$f":"IF(AND($AZ$16=1,#REF!=\"\"),11,IF(#REF!<0.1,-#REF!,IF(AND(#REF!>-0.1,#REF!<10),11,(#REF!+2))))","v":{"$error":"#REF!"}},{"$f":"IF(AND($AY$16=1,#REF!=\"\"),11,IF(#REF!>-0.1,#REF!,IF(AND(#REF!<0.1,#REF!>-10),11,(-#REF!+2))))","v":{"$error":"#REF!"}},{"$f":"IF($BB$16+$BC$16>2,IF($BB$16+$BC$16=3,$AV$49+$AX$49+$AZ$49,IF($BB$16+$BC$16=4,$AV$49+$AX$49+$AZ$49+$BB$49,IF($BB$16+$BC$16=5,$AV$49+$AX$49+$AZ$49+$BB$49+$BD$49,IF($BB$16+$BC$16=6,$AV$49+$AX$49+$AZ$49+$BB$49+$BD$49+$AV$55,IF($BB$16+$BC$16=7,$AV$49+$AX$49+$AZ$49+$BB$49+$BD$49+$AV$55+$AX$55,\"\"))))),\"\")","v":""},{"$f":"IF($BB$16+$BC$16>2,IF($BB$16+$BC$16=3,$AW$49+$AY$49+$BA$49,IF($BB$16+$BC$16=4,$AW$49+$AY$49+$BA$49+$BC$49,IF($BB$16+$BC$16=5,$AW$49+$AY$49+$BA$49+$BC$49+$BE$49,IF($BB$16+$BC$16=6,$AW$49+$AY$49+$BA$49+$BC$49+$BE$49+$AW$55,IF($BB$16+$BC$16=7,$AW$49+$AY$49+$BA$49+$BC$49+$BE$49+$AW$55+$AY$55,\"\"))))),\"\")","v":""}]
[null,null,null,null,null,null,null,null,null,null,null,null,null,null,null,null,null,null,null,null,"Classement : "]
[null,null,null,null,null,null,null,null,null,null,null,null,null,null,null,null,null,null,null,null,null,null,null,null,null,{"$f":"IF($K16<>\"\",1,0)","v":1},{"$f":"IF($K17<>\"\",1,0)","v":1},{"$f":"IF($K18<>\"\",1,0)","v":1},{"$f":"IF($K19<>\"\",1,0)","v":1},{"$f":"IF($K20<>\"\",1,0)","v":1},{"$f":"IF($K21<>\"\",1,0)","v":1},{"$f":"IF($K22<>\"\",1,0)","v":1},{"$f":"IF($K23<>\"\",1,0)","v":1}]
[null,"CLASSEMENT",null,null,null,null,null,null,null,null,null,null,null,null,null,null,null,null,null,null,null,null,null,null,{"$f":"COUNT($Z$56:$AG$56)","v":0},{"$f":"IF($K$16<>\"\",$K$16,\"\")","v":1},{"$f":"IF($K$17<>\"\",$K$17,\"\")","v":2},{"$f":"IF($K$18<>\"\",$K$18,\"\")","v":3},{"$f":"IF($K$19<>\"\",$K$19,\"\")","v":4},{"$f":"IF($K$20<>\"\",$K$20,\"\")","v":5},{"$f":"IF($K$21<>\"\",$K$21,\"\")","v":6},{"$f":"IF($K$22<>\"\",$K$22,\"\")","v":7},{"$f":"IF($K$23<>\"\",$K$23,\"\")","v":8}]
[null,"Rang","Dos.",null,"NOM Prénom",null,null,null,null,null,null,null,null,null,null,null,null,null,null,null,null,null,null,null,null,{"$f":"IF($Z$56<>\"\",$Z$55,\"\")","v":""},{"$f":"IF($AA$56<>\"\",$AA$55,\"\")","v":""},{"$f":"IF($AB$56<>\"\",$AB$55,\"\")","v":""},{"$f":"IF($AC$56<>\"\",$AC$55,\"\")","v":""},{"$f":"IF($AD$56<>\"\",$AD$55,\"\")","v":""},{"$f":"IF($AE$56<>\"\",$AE$55,\"\")","v":""},{"$f":"IF($AF$56<>\"\",$AF$55,\"\")","v":""},{"$f":"IF($AG$56<>\"\",$AG$55,\"\")","v":""}]
[null,"1er",{"$f":"IF(AND($Y$58>0,$Y$58=$K$24,$Z$56<>\"\"),HLOOKUP(1,$Z$56:$AG$59,3,FALSE),\"\")","v":""},null,{"$f":"IF($C$60<>\"\",VLOOKUP($C$60,Liste!$C$17:$I$24,3,FALSE),\"\")","v":""},null,null,null,null,null,null,null,null,{"$f":"IF($C$60<>\"\",HLOOKUP(1,$Z$56:$AG$59,4,FALSE)&\" pts\",\"\")","v":""},null,null,null,null,null,null,null,null,null,null,null,{"$f":"IF($BL$32<>\"\",$BL$32,IF($BL$25<>\"\",$BL$25,IF($BL$18<>\"\",$BL$18,\"\")))","v":""},null,null,{"$f":"IF($BN$32<>\"\",$BN$32,IF($BN$25<>\"\",$BN$25,IF($BN$18<>\"\",$BN$18,\"\")))","v":""},{"$f":"IF($BP$32<>\"\",$BP$32,IF($BP$25<>\"\",$BP$25,IF($BP$18<>\"\",$BP$18,\"\")))","v":""}]
[null,"2ème",{"$f":"IF(AND($Y$58>0,$Y$58=$K$24,$AA$56<>\"\"),HLOOKUP(2,$Z$56:$AG$59,3,FALSE),\"\")","v":""},null,{"$f":"IF($C$61<>\"\",VLOOKUP($C$61,Liste!$C$17:$I$24,3,FALSE),\"\")","v":""},null,null,null,null,null,null,null,null,{"$f":"IF($C$61<>\"\",HLOOKUP(2,$Z$56:$AG$60,4,FALSE)&\" pts\",\"\")","v":""}]
[null,"3ème",{"$f":"IF(AND($Y$58>0,$Y$58=$K$24,$AB$56<>\"\"),HLOOKUP(3,$Z$56:$AG$59,3,FALSE),\"\")","v":""},null,{"$f":"IF($C$62<>\"\",VLOOKUP($C$62,Liste!$C$17:$I$24,3,FALSE),\"\")","v":""},null,null,null,null,null,null,null,null,{"$f":"IF($C$62<>\"\",HLOOKUP(3,$Z$56:$AG$60,4,FALSE)&\" pts\",\"\")","v":""}]
[null,"4ème",{"$f":"IF(AND($Y$58>0,$Y$58=$K$24,$AC$56<>\"\"),HLOOKUP(4,$Z$56:$AG$59,3,FALSE),\"\")","v":""},null,{"$f":"IF($C$63<>\"\",VLOOKUP($C$63,Liste!$C$17:$I$24,3,FALSE),\"\")","v":""},null,null,null,null,null,null,null,null,{"$f":"IF($C$63<>\"\",HLOOKUP(4,$Z$56:$AG$60,4,FALSE)&\" pts\",\"\")","v":""}]
[null,"5ème",{"$f":"IF(AND($Y$58>0,$Y$58=$K$24,$AD$56<>\"\"),HLOOKUP(5,$Z$56:$AG$59,3,FALSE),\"\")","v":""},null,{"$f":"IF($C$64<>\"\",VLOOKUP($C$64,Liste!$C$17:$I$24,3,FALSE),\"\")","v":""},null,null,null,null,null,null,null,null,{"$f":"IF($C$64<>\"\",HLOOKUP(5,$Z$56:$AG$60,4,FALSE)&\" pts\",\"\")","v":""},null,null,null,null,null,"Nom et signature"]
[null,"6ème",{"$f":"IF(AND($Y$58>0,$Y$58=$K$24,$AD$56<>\"\"),HLOOKUP(6,$Z$56:$AG$59,3,FALSE),\"\")","v":""},null,{"$f":"IF($C$65<>\"\",VLOOKUP($C$65,Liste!$C$17:$I$24,3,FALSE),\"\")","v":""},null,null,null,null,null,null,null,null,{"$f":"IF($C$65<>\"\",HLOOKUP(6,$Z$56:$AG$60,4,FALSE)&\" pts\",\"\")","v":""},null,null,null,null,null,"du juge arbitre"]
[null,"7ème",{"$f":"IF(AND($Y$58>0,$Y$58=$K$24,$AF$56<>\"\"),HLOOKUP(7,$Z$56:$AG$59,3,FALSE),\"\")","v":""},null,{"$f":"IF($C$66<>\"\",VLOOKUP($C$66,Liste!$C$17:$I$24,3,FALSE),\"\")","v":""},null,null,null,null,null,null,null,null,{"$f":"IF($C$66<>\"\",HLOOKUP(7,$Z$56:$AG$60,4,FALSE)&\" pts\",\"\")","v":""},null,null,null,null,null,{"$f":"IF(Prépa!$E$33<>\"\",Prépa!$E$33,\"\")","v":"Nico Angenon"}]
[null,"3ème",{"$f":"IF(AND($Y$58>0,$Y$58=$K$24,$AG$56<>\"\"),HLOOKUP(8,$Z$56:$AG$59,3,FALSE),\"\")","v":""},null,{"$f":"IF($C$67<>\"\",VLOOKUP($C$67,Liste!$C$17:$I$24,3,FALSE),\"\")","v":""},null,null,null,null,null,null,null,null,{"$f":"IF($C$67<>\"\",HLOOKUP(8,$Z$56:$AG$60,4,FALSE)&\" pts\",\"\")","v":""}]

{"sheet":"GROUPE B","index":5,"n_rows":67,"n_cols":81,"rows_kept":67,"cut":false,"hidden":false,"merged":[[4,70,4,77],[5,70,5,71],[5,72,5,73],[5,74,5,75],[5,76,5,77],[6,70,6,71],[6,72,6,73],[6,74,6,75],[6,76,6,77],[2,0,3,30],[3,47,6,54],[4,6,4,25],[4,63,4,64],[4,65,4,66],[4,67,4,68],[5,0,6,30],[5,63,5,64],[5,65,5,66],[5,67,5,68],[10,62,11,80],[11,47,12,48],[11,50,12,51],[11,53,12,54],[11,56,12,57],[12,62,12,68],[12,70,12,77],[8,0,9,30],[8,47,8,48],[8,50,8,51],[9,47,9,48],[9,50,9,51],[10,0,13,30],[10,35,11,42],[7,35,9,42],[7,70,7,71],[7,72,7,73],[7,74,7,75],[7,76,7,77],[14,65,14,66],[14,67,14,68],[14,70,14,71],[14,72,14,73],[14,74,14,75],[14,76,14,77],[13,76,13,77],[14,1,14,9],[14,10,14,12],[14,13,14,15],[14,16,14,17],[14,18,14,19],[14,20,14,21],[14,22,14,32],[14,35,15,42],[14,63,14,64],[13,63,13,64],[13,65,13,66],[13,67,13,68],[13,70,13,71],[13,72,13,73],[13,74,13,75],[15,74,15,75],[15,76,15,77],[16,10,16,12],[16,13,16,15],[16,16,16,17],[16,18,16,19],[16,20,16,21],[16,22,16,32],[16,63,16,64],[15,22,15,32],[15,63,15,64],[15,65,15,66],[15,67,15,68],[15,70,15,71],[15,72,15,73],[15,1,15,9],[15,10,15,12],[15,13,15,15],[15,16,15,17],[15,18,15,19],[15,20,15,21],[16,65,16,66],[16,67,16,68],[17,1,17,9],[17,10,17,12],[17,13,17,15],[17,16,17,17],[17,18,17,19],[17,20,17,21],[17,22,17,32],[17,35,18,42],[17,63,17,64],[17,65,17,66],[17,67,17,68],[18,1,18,9],[18,10,18,12],[18,13,18,15],[18,16,18,17],[18,18,18,19],[18,20,18,21],[18,22,18,32],[18,63,18,64],[18,65,18,66],[18,67,18,68],[16,1,16,9],[20,74,20,75],[20,76,20,77],[20,72,20,73],[18,69,18,70],[19,1,19,9],[19,10,19,12],[19,13,19,15],[19,16,19,17],[19,18,19,19],[19,20,19,21],[19,22,19,32],[19,62,19,68],[19,70,19,77],[21,1,21,9],[21,10,21,12],[21,13,21,15],[21,16,21,17],[21,18,21,19],[21,20,21,21],[21,22,21,32],[21,70,21,71],[20,35,21,42],[20,63,20,64],[20,65,20,66],[20,67,20,68],[20,70,20,71],[20,1,20,9],[20,10,20,12],[20,13,20,15],[20,16,20,17],[20,18,20,19],[20,20,20,21],[20,22,20,32],[21,72,21,73],[24,0,25,0],[24,1,25,1],[24,2,25,4],[24,5,25,5],[24,6,25,10],[24,11,25,13],[21,74,21,75],[21,76,21,77],[22,1,22,9],[22,10,22,12],[22,13,22,15],[22,16,22,17],[22,18,22,19],[22,20,22,21],[22,22,22,32],[22,70,22,71],[24,14,25,18],[24,19,25,19],[24,25,24,32],[24,63,24,64],[24,65,24,66],[24,67,24,68],[22,72,22,73],[22,74,22,75],[22,76,22,77],[23,35,24,42],[26,6,26,11],[26,13,26,18],[26,35,27,42],[26,62,26,68],[26,70,26,77],[27,6,27,11],[27,13,27,18],[27,63,27,64],[27,65,27,66],[27,67,27,68],[27,70,27,71],[27,72,27,73],[27,74,27,75],[27,76,27,77],[28,6,28,11],[28,13,28,18],[28,70,28,71],[28,72,28,73],[28,74,28,75],[28,76,28,77],[32,6,32,11],[32,13,32,18],[32,35,33,42],[33,6,33,11],[33,13,33,18],[33,63,33,68],[29,76,29,77],[30,6,30,11],[30,13,30,18],[31,6,31,11],[31,13,31,18],[31,63,31,64],[31,65,31,66],[31,67,31,68],[29,6,29,11],[29,13,29,18],[29,35,30,42],[29,70,29,71],[29,72,29,73],[29,74,29,75],[36,63,36,64],[36,65,36,66],[36,67,36,68],[37,6,37,11],[37,13,37,18],[37,36,38,41],[38,6,38,11],[38,13,38,18],[34,6,34,11],[34,13,34,18],[34,63,34,64],[34,65,34,66],[34,67,34,68],[35,6,35,11],[35,13,35,18],[35,63,35,64],[35,65,35,66],[35,67,35,68],[39,6,39,11],[39,13,39,18],[40,6,40,11],[40,13,40,18],[40,36,41,40],[41,6,41,11],[41,13,41,18],[36,6,36,11],[36,13,36,18],[44,47,44,58],[45,6,45,11],[45,13,45,18],[45,47,45,48],[45,49,45,50],[45,51,45,52],[45,53,45,54],[45,55,45,56],[42,6,42,11],[42,13,42,18],[43,6,43,11],[43,13,43,18],[44,6,44,11],[44,13,44,18],[50,47,50,52],[51,6,51,11],[51,13,51,18],[51,47,51,48],[51,49,51,50],[46,6,46,11],[46,13,46,18],[47,6,47,11],[47,13,47,18],[48,6,48,11],[48,13,48,18],[52,6,52,11],[52,13,52,18],[53,6,53,11],[53,13,53,18],[54,0,55,19],[54,20,54,24],[55,20,55,24],[49,6,49,11],[49,13,49,18],[50,6,50,11],[50,13,50,18],[58,19,58,20],[59,2,59,3],[59,4,59,12],[59,13,59,14],[59,15,59,16],[59,17,59,18],[57,1,57,14],[58,2,58,3],[58,4,58,12],[58,13,58,14],[58,15,58,16],[58,17,58,18],[60,2,60,3],[60,4,60,12],[60,13,60,14],[60,15,60,16],[62,2,62,3],[62,4,62,12],[62,13,62,14],[63,2,63,3],[60,17,60,18],[61,2,61,3],[61,4,61,12],[61,13,61,14],[61,15,61,16],[61,17,61,18],[65,2,65,3],[65,4,65,12],[65,13,65,14],[65,19,66,26],[66,2,66,3],[63,4,63,12],[63,13,63,14],[63,19,63,26],[64,2,64,3],[64,4,64,12],[64,13,64,14],[64,19,64,26],[66,4,66,12],[66,13,66,14]]}
[null,null,null,null,{"$f":"Prépa!$C$1","v":"FEDERATION FRANCAISE"},null,null,null,null,null,null,null,null,null,null,null,null,null,null,null,null,null,null,null,null,null,null,null,null,null,null,null,{"$f":"IF(Prépa!$O$92<>0,\"Saison \"&Prépa!$O$92,\"\")","v":"Saison 2017 - 2018"}]
[null,null,null,null,{"$f":"Prépa!$C$2","v":"HANDISPORT"},null,null,null,null,null,null,null,null,null,null,null,null,null,null,null,null,null,null,null,null,null,null,null,null,null,null,null,{"$f":"IF(Prépa!$O$79<>0,Prépa!$O$79,\"\")","v":"2ème Tour"}]
[{"$f":"IF(Prépa!$O$10<>0,Prépa!$O$10,\"\")&IF(Prépa!$O$32<>\"\",\" - \"&Prépa!$O$32,\"\")","v":"Critérium Fédéral - Nat 2B Nord"}]
[null,null,null,null,null,null,null,null,null,null,null,null,null,null,null,null,null,null,null,null,null,null,null,null,null,null,null,null,null,null,null,null,null,null,null,null,null,null,null,null,null,null,null,null,null,null,null,{"$f":"A11","v":0}]
[null,null,null,null,null,null,null,null,null,null,null,null,null,null,null,null,null,null,null,null,null,null,null,null,null,null,null,null,null,null,null,null,null,null,null,null,null,null,null,null,null,null,null,null,null,null,null,null,null,null,null,null,null,null,null,null,null,null,null,null,null,null,null,{"$f":"IF($K$16<>\"\",\"Joueur 1\",\"\")","v":"Joueur 1"},null,{"$f":"IF($K$17<>\"\",\"Joueur 2\",\"\")","v":"Joueur 2"},null,{"$f":"IF($K$18<>\"\",\"Joueur 3\",\"\")","v":"Joueur 3"},null,null,"Classement avant départage"]
[{"$f":"IF(Prépa!$D$14<>0,Prépa!$D$14,\"\")&IF(Prépa!$K$110<>0,\" - \"&Prépa!$K$110,\"\")","v":"TOURS - 10 Fevrier 2018"},null,null,null,null,null,null,null,null,null,null,null,null,null,null,null,null,null,null,null,null,null,null,null,null,null,null,null,null,null,null,null,null,null,null,null,null,null,null,null,null,null,null,null,null,null,null,null,null,null,null,null,null,null,null,null,null,null,null,null,null,null,"Total des victoires è",{"$f":"IF($AB$55<>\"\",$AB$55,\"\")","v":2},null,{"$f":"IF($AC$55<>\"\",$AC$55,\"\")","v":2},null,{"$f":"IF($AD$55<>\"\",$AD$55,\"\")","v":2},null,null,null,null,{"$f":"IF($K$16<>\"\",\"Joueur 1\",\"\")","v":"Joueur 1"},null,{"$f":"IF($K$17<>\"\",\"Joueur 2\",\"\")","v":"Joueur 2"},null,{"$f":"IF($K$18<>\"\",\"Joueur 3\",\"\")","v":"Joueur 3"}]
[null,null,null,null,null,null,null,null,null,null,null,null,null,null,null,null,null,null,null,null,null,null,null,null,null,null,null,null,null,null,null,null,null,null,null,null,null,null,null,null,null,null,null,null,null,null,null,null,null,null,null,null,null,null,null,null,null,null,null,null,null,null,null,null,null,null,null,null,null,null,"Points",null,{"$f":"IF($BL$6<>\"\",$BL$6,\"\")","v":2},null,{"$f":"IF($BN$6<>\"\",$BN$6,\"\")","v":2},null,{"$f":"IF($BP$6<>\"\",$BP$6,\"\")","v":2},null,{"$f":"IF($BU$8=\"?\",COUNTIF($BU$7:$BZ$7,$BU$7),\"\")","v":""},{"$f":"IF($BW$8=\"?\",COUNTIF($BU$7:$BZ$7,$BW$7),\"\")","v":""},{"$f":"IF($BY$8=\"?\",COUNTIF($BU$7:$BZ$7,$BY$7),\"\")","v":""}]
[null,null,null,null,null,null,null,null,null,null,null,null,null,null,null,null,null,null,null,null,null,null,null,null,null,null,null,null,null,null,null,null,null,null,null,"IMPRIMER",null,null,null,null,null,null,null,null,null,null,null,null,null,null,null,null,null,null,null,null,null,null,null,null,null,null,null,null,null,null,null,null,null,null,"Rang",null,{"$f":"IF($BL$6<>\"\",IF($AY$10=$AV$10,IF($BU$7=$BW$7,\"?\",IF($BU$7=$BY$7,\"?\",RANK($BU$7,$BU$7:$BZ$7))),\"\"),\"\")","v":""},null,{"$f":"IF($BN$6<>\"\",IF($AV$10=$AY$10,IF($BW$7=$BU$7,\"?\",IF($BW$7=$BY$7,\"?\",RANK($BW$7,$BU$7:$BZ$7))),\"\"),\"\")","v":""},null,{"$f":"IF($BP$6<>\"\",IF($AV$10=$AY$10,IF($BY$7=$BU$7,\"?\",IF($BY$7=$BW$7,\"?\",RANK($BY$7,$BU$7:$BZ$7))),\"\"),\"\")","v":""},null,{"$f":"IF($BU$8<>\"\",SUM($CA$7:$CC$7),\"\")","v":""}]
[{"$f":"IF(Prépa!$O$72<>\"\",Prépa!$O$72,\"\")","v":"OPEN Assis"},null,null,null,null,null,null,null,null,null,null,null,null,null,null,null,null,null,null,null,null,null,null,null,null,null,null,null,null,null,null,null,null,null,null,null,null,null,null,null,null,null,null,null,null,null,null,"A jouer",null,null,"Jouées"]
[null,null,null,null,null,null,null,null,null,null,null,null,null,null,null,null,null,null,null,null,null,null,null,null,null,null,null,null,null,null,null,null,null,null,null,null,null,null,null,null,null,null,null,null,null,null,null,{"$f":"($K$19*($K$19-1)/2)","v":78},null,null,{"$f":"SUM($AW$14:$AW$17)","v":0}]
[null,null,null,null,null,null,null,null,null,null,null,null,null,null,null,null,null,null,null,null,null,null,null,null,null,null,null,null,null,null,null,null,null,null,null,"  Feuille de Poule C",null,null,null,null,null,null,null,null,null,null,null,null,null,null,null,null,null,null,null,null,null,null,null,null,null,null,"1er DEPARTAGE"]
[null,null,null,null,null,null,null,null,null,null,null,null,null,null,null,null,null,null,null,null,null,null,null,null,null,null,null,null,null,null,null,null,null,null,null,null,null,null,null,null,null,null,null,null,null,null,null,"Parties",null,null,"Forfaits",null,null,"Manches",null,null,"Points parties"]
[null,null,null,null,null,null,null,null,null,null,null,null,null,null,null,null,null,null,null,null,null,null,null,null,null,null,null,null,null,null,null,null,null,null,null,null,null,null,null,null,null,null,null,null,null,null,null,null,null,null,null,true,null,null,null,null,null,null,null,null,null,null,"Départage aux parties Niveau 1",null,null,null,null,null,null,null,"Clt après départage au parties"]
[null,null,null,null,null,null,null,null,null,null,null,null,null,null,null,null,null,null,null,null,null,null,null,null,null,null,null,null,null,null,null,null,null,null,null,null,null,null,null,null,null,null,null,null,null,null,null,{"$f":"IF(AND($C$27<>\"\",$E$27<>\"\"),$C$27&\" - \"&$E$27,\"\")","v":"1 - 8"},{"$f":"IF($Z$27<>\"\",1,0)","v":0},null,{"$f":"IF($F$27=\"F\",1,0)","v":0},{"$f":"IF($T$27=\"F\",1,0)","v":0},null,{"$f":"IF($AZ$14=1,3,IF($U$27<>\"\",COUNTIF($U$27:$Y$27,\">=0\"),0))","v":0},{"$f":"IF($AY$14=1,3,IF($U$27<>\"\",COUNTIF($U$27:$Y$27,\"<0\"),0))","v":0},null,{"$f":"IF($AY$14=1,0,IF($AZ$14=1,2,IF($BB$14<>\"\",IF($BB$14=3,2,IF($BC$14=3,1,\"\")),\"\")))","v":""},{"$f":"IF($AZ$14=1,0,IF($AY$14=1,2,IF($BC$14<>\"\",IF($BC$14=3,2,IF($BB$14=3,1,\"\")),\"\")))","v":""},null,null,null,null,null,{"$f":"IF($BU$8=\"?\",\"joueur 1\",\"\")","v":""},null,{"$f":"IF($BW$8=\"?\",\"joueur 2\",\"\")","v":""},null,{"$f":"IF($BY$8=\"?\",\"joueur 3\",\"\")","v":""},null,null,null,null,{"$f":"IF($K$16<>\"\",\"Joueur 1\",\"\")","v":"Joueur 1"},null,{"$f":"IF($K$17<>\"\",\"Joueur 2\",\"\")","v":"Joueur 2"},null,{"$f":"IF($K$18<>\"\",\"Joueur 3\",\"\")","v":"Joueur 3"}]
["N°","NOM Prénom",null,null,null,null,null,null,null,null,"Dossard",null,null,"N° de Licence",null,null,"Classe",null,"Zone",null,"Pts FFTT",null,"Association",null,null,null,null,null,null,null,null,null,null,null,null,"     Parties Tour 1 C",null,null,null,null,null,null,null,null,null,null,null,{"$f":"IF(AND($C$28<>\"\",$E$28<>\"\"),$C$28&\" - \"&$E$28,\"\")","v":"2 - 7"},{"$f":"IF($Z$28<>\"\",1,0)","v":0},null,{"$f":"IF($F$28=\"F\",1,0)","v":1},{"$f":"IF($T$28=\"F\",1,0)","v":0},null,{"$f":"IF($AZ$15=1,3,IF($U$28<>\"\",COUNTIF($U$28:$Y$28,\">=0\"),0))","v":0},{"$f":"IF($AY$15=1,3,IF($U$28<>\"\",COUNTIF($U$28:$Y$28,\"<0\"),0))","v":3},null,{"$f":"IF($AY$15=1,0,IF($AZ$15=1,2,IF($BB$15<>\"\",IF($BB$15=3,2,IF($BC$15=3,1,\"\")),\"\")))","v":0},{"$f":"IF($AZ$15=1,0,IF($AY$15=1,2,IF($BC$15<>\"\",IF($BC$15=3,2,IF($BB$15=3,1,\"\")),\"\")))","v":2},null,null,null,null,{"$f":"IF($BL$14<>\"\",IF($BU$7=$BW$7,\"1 - 2\",\"\"),\"\")","v":""},{"$f":"IF($BK$15<>\"\",$BE$15,\"\")","v":""},null,{"$f":"IF($BK$15<>\"\",$BF$15,\"\")","v":""},null,null,null,null,"Points",null,{"$f":"IF($BL$18=\"\",$BU$7,($BU$7+($BL$18*0.1)))","v":2},null,{"$f":"IF($BN$18=\"\",$BW$7,($BW$7+($BN$18*0.1)))","v":2},null,{"$f":"IF($BP$18=\"\",$BY$7,($BY$7+($BP$18*0.1)))","v":2},null,{"$f":"IF($BU$16=\"?\",COUNTIF($BU$15:$BZ$15,$BU$15),\"\")","v":""},{"$f":"IF($BW$16=\"?\",COUNTIF($BU$15:$BZ$15,$BW$15),\"\")","v":""},{"$f":"IF($BY$16=\"?\",COUNTIF($BU$15:$BZ$15,$BY$15),\"\")","v":""}]
[1,{"$f":"IF($K$16<>\"\",VLOOKUP($K$16,Liste!$C$30:$I$37,3,FALSE),\"\")","v":"PAPIRER Alan"},null,null,null,null,null,null,null,null,{"$f":"IF(Poules!$P34<>\"\",Poules!$P34,\"\")","v":9},null,null,{"$f":"IF($K$16<>\"\",VLOOKUP($K$16,Liste!$C$30:$I$37,2,FALSE),\"\")","v":0},null,null,{"$f":"IF($K$16<>\"\",VLOOKUP($K$16,Liste!$C$30:$I$37,4,FALSE),\"\")","v":1},null,{"$f":"IF($K$16<>\"\",VLOOKUP($K$16,Liste!$C$30:$I$37,5,FALSE),\"\")","v":"NE"},null,{"$f":"IF($K$16<>\"\",VLOOKUP($K$16,Liste!$C$30:$I$37,6,FALSE),\"\")","v":0},null,{"$f":"IF($K$16<>\"\",VLOOKUP($K$16,Liste!$C$30:$I$37,7,FALSE),\"\")","v":"MOULINS LES METZ HANDISPORT"},null,null,null,null,null,null,null,null,null,null,null,null,null,null,null,null,null,null,null,null,null,null,null,null,{"$f":"IF(AND(C29<>\"\",E29<>\"\"),C29&\" - \"&E29,\"\")","v":"3 - 6"},{"$f":"IF(AB29<>\"\",1,0)","v":0},null,{"$f":"IF(F29=\"F\",1,0)","v":0},{"$f":"IF(T29=\"F\",1,0)","v":0},null,{"$f":"IF(AZ16=1,3,IF(U29<>\"\",COUNTIF(U29:Y29,\">=0\"),0))","v":0},{"$f":"IF(AY16=1,3,IF(U29<>\"\",COUNTIF(U29:Y29,\"<0\"),0))","v":0},null,{"$f":"IF(AY16=1,0,IF(AZ16=1,2,IF(BB16<>\"\",IF(BB16=3,2,IF(BC16=3,1,\"\")),\"\")))","v":""},{"$f":"IF(AZ16=1,0,IF(AY16=1,2,IF(BC16<>\"\",IF(BC16=3,2,IF(BB16=3,1,\"\")),\"\")))","v":""},null,null,null,null,{"$f":"IF($BL$14<>\"\",IF($BU$7=$BY$7,\"1 - 3\",\"\"),\"\")","v":""},{"$f":"IF($BK$16<>\"\",BE14,\"\")","v":""},null,null,null,{"$f":"IF($BK$16<>\"\",BF14,\"\")","v":""},null,null,"Rang",null,{"$f":"IF($BL$6<>\"\",IF($AV$10=$AY$10,IF($BU$15=$BW$15,\"?\",IF($BU$15=$BY$15,\"?\",RANK($BU$15,$BU$15:$BZ$15))),\"\"),\"\")","v":""},null,{"$f":"IF($BN$6<>\"\",IF($AV$10=$AY$10,IF($BW$15=$BU$15,\"?\",IF($BW$15=$BY$15,\"?\",RANK($BW$15,$BU$15:$BZ$15))),\"\"),\"\")","v":""},null,{"$f":"IF($BP$6<>\"\",IF($AV$10=$AY$10,IF($BY$15=$BU$15,\"?\",IF($BY$15=$BW$15,\"?\",RANK($BY$15,$BU$15:$BZ$15))),\"\"),\"\")","v":""},null,{"$f":"IF($BU$16<>\"\",SUM($CA$15:$CC$15),\"\")","v":""}]
[2,{"$f":"IF($K$17<>\"\",VLOOKUP($K$17,Liste!$C$30:$I$37,3,FALSE),\"\")","v":"HENOUX Frédéric"},null,null,null,null,null,null,null,null,{"$f":"IF(Poules!$P35<>\"\",Poules!$P35,\"\")","v":16},null,null,{"$f":"IF($K$17<>\"\",VLOOKUP($K$17,Liste!$C$30:$I$37,2,FALSE),\"\")","v":"WO"},null,null,{"$f":"IF($K$17<>\"\",VLOOKUP($K$17,Liste!$C$30:$I$37,4,FALSE),\"\")","v":5},null,{"$f":"IF($K$17<>\"\",VLOOKUP($K$17,Liste!$C$30:$I$37,5,FALSE),\"\")","v":"NE"},null,{"$f":"IF($K$17<>\"\",VLOOKUP($K$17,Liste!$C$30:$I$37,6,FALSE),\"\")","v":0},null,{"$f":"IF($K$17<>\"\",VLOOKUP($K$17,Liste!$C$30:$I$37,7,FALSE),\"\")","v":"CTT CHATEAU THIERRY"},null,null,null,null,null,null,null,null,null,null,null,null,null,null,null,null,null,null,null,null,null,null,null,null,{"$f":"IF(AND(C30<>\"\",E30<>\"\"),C30&\" - \"&E30,\"\")","v":"4 - 5"},{"$f":"IF(AB30<>\"\",1,0)","v":0},null,{"$f":"IF(F30=\"F\",1,0)","v":0},{"$f":"IF(T30=\"F\",1,0)","v":0},null,{"$f":"IF(AZ17=1,3,IF(U30<>\"\",COUNTIF(U30:Y30,\">=0\"),0))","v":0},{"$f":"IF(AY17=1,3,IF(U30<>\"\",COUNTIF(U30:Y30,\"<0\"),0))","v":0},null,{"$f":"IF(AY17=1,0,IF(AZ17=1,2,IF(BB17<>\"\",IF(BB17=3,2,IF(BC17=3,1,\"\")),\"\")))","v":""},{"$f":"IF(AZ17=1,0,IF(AY17=1,2,IF(BC17<>\"\",IF(BC17=3,2,IF(BB17=3,1,\"\")),\"\")))","v":""},null,null,null,null,{"$f":"IF($BN$14<>\"\",IF($BW$7=$BY$7,\"2 - 3\",\"\"),\"\")","v":""},null,null,{"$f":"IF($BK$17<>\"\",BE16,\"\")","v":""},null,{"$f":"IF($BK$17<>\"\",BF16,\"\")","v":""}]
[3,{"$f":"IF($K$18<>\"\",VLOOKUP($K$18,Liste!$C$30:$I$37,3,FALSE),\"\")","v":"ADJAL Yorick"},null,null,null,null,null,null,null,null,{"$f":"IF(Poules!$P36<>\"\",Poules!$P36,\"\")","v":11},null,null,{"$f":"IF($K$18<>\"\",VLOOKUP($K$18,Liste!$C$30:$I$37,2,FALSE),\"\")","v":0},null,null,{"$f":"IF($K$18<>\"\",VLOOKUP($K$18,Liste!$C$30:$I$37,4,FALSE),\"\")","v":3},null,{"$f":"IF($K$18<>\"\",VLOOKUP($K$18,Liste!$C$30:$I$37,5,FALSE),\"\")","v":"NE"},null,{"$f":"IF($K$18<>\"\",VLOOKUP($K$18,Liste!$C$30:$I$37,6,FALSE),\"\")","v":0},null,{"$f":"IF($K$18<>\"\",VLOOKUP($K$18,Liste!$C$30:$I$37,7,FALSE),\"\")","v":"A. VOISINS TT"},null,null,null,null,null,null,null,null,null,null,null,null,"     Parties Tour 2 C",null,null,null,null,null,null,null,null,null,null,null,"1 - 7",0,null,0,0,null,0,0,null,"","",null,null,null,null,"Total",{"$f":"IF($BL$14<>\"\",SUM($BL$15:$BM$16),\"\")","v":""},null,{"$f":"IF($BN$14<>\"\",SUM($BN$15:$BO$17),\"\")","v":""},null,{"$f":"IF($BP$14<>\"\",SUM($BP$15:$BQ$17),\"\")","v":""}]
[4,{"$f":"IF($K$19<>\"\",VLOOKUP($K$19,Liste!$C$30:$I$37,3,FALSE),\"\")","v":"KERGOSIEN Arnaud"},null,null,null,null,null,null,null,null,{"$f":"IF(Poules!$P37<>\"\",Poules!$P37,\"\")","v":13},null,null,{"$f":"IF($K$19<>\"\",VLOOKUP($K$19,Liste!$C$30:$I$37,2,FALSE),\"\")","v":0},null,null,{"$f":"IF($K$19<>\"\",VLOOKUP($K$19,Liste!$C$30:$I$37,4,FALSE),\"\")","v":3},null,{"$f":"IF($K$19<>\"\",VLOOKUP($K$19,Liste!$C$30:$I$37,5,FALSE),\"\")","v":"NO"},null,{"$f":"IF($K$19<>\"\",VLOOKUP($K$19,Liste!$C$30:$I$37,6,FALSE),\"\")","v":0},null,{"$f":"IF($K$19<>\"\",VLOOKUP($K$19,Liste!$C$30:$I$37,7,FALSE),\"\")","v":"F.O.L.C.L.O."},null,null,null,null,null,null,null,null,null,null,null,null,null,null,null,null,null,null,null,null,null,null,null,null,"6 - 8",0,null,0,0,null,0,0,null,"",""]
[5,{"$f":"IF($K$20<>\"\",VLOOKUP($K$20,Liste!$C$30:$I$37,3,FALSE),\"\")","v":"BELTRAND Arnaud"},null,null,null,null,null,null,null,null,{"$f":"IF(Poules!$P38<>\"\",Poules!$P38,\"\")","v":14},null,null,{"$f":"IF($K$20<>\"\",VLOOKUP($K$20,Liste!$C$30:$I$37,2,FALSE),\"\")","v":0},null,null,{"$f":"IF($K$20<>\"\",VLOOKUP($K$20,Liste!$C$30:$I$37,4,FALSE),\"\")","v":4},null,{"$f":"IF($K$20<>\"\",VLOOKUP($K$20,Liste!$C$30:$I$37,5,FALSE),\"\")","v":"NO"},null,{"$f":"IF($K$20<>\"\",VLOOKUP($K$20,Liste!$C$30:$I$37,6,FALSE),\"\")","v":0},null,{"$f":"IF($K$20<>\"\",VLOOKUP($K$20,Liste!$C$30:$I$37,7,FALSE),\"\")","v":"TT JOUE LES TOURS"},null,null,null,null,null,null,null,null,null,null,null,null,null,null,null,null,null,null,null,null,null,null,null,null,"2 - 5",0,null,1,0,null,0,3,null,0,2,null,null,null,null,"Départage aux manches Niveau 1",null,null,null,null,null,null,null,"Clt après départage au manches"]
[6,{"$f":"IF($K$21<>\"\",VLOOKUP($K$21,Liste!$C$30:$I$37,3,FALSE),\"\")","v":"SIREAU GOSSIAUX Florence"},null,null,null,null,null,null,null,null,{"$f":"IF(Poules!$P39<>\"\",Poules!$P39,\"\")","v":12},null,null,{"$f":"IF($K$21<>\"\",VLOOKUP($K$21,Liste!$C$30:$I$37,2,FALSE),\"\")","v":0},null,null,{"$f":"IF($K$21<>\"\",VLOOKUP($K$21,Liste!$C$30:$I$37,4,FALSE),\"\")","v":2},null,{"$f":"IF($K$21<>\"\",VLOOKUP($K$21,Liste!$C$30:$I$37,5,FALSE),\"\")","v":"NE"},null,{"$f":"IF($K$21<>\"\",VLOOKUP($K$21,Liste!$C$30:$I$37,6,FALSE),\"\")","v":0},null,{"$f":"IF($K$21<>\"\",VLOOKUP($K$21,Liste!$C$30:$I$37,7,FALSE),\"\")","v":"A. VOISINS TT"},null,null,null,null,null,null,null,null,null,null,null,null,"     Parties Tour 3 C",null,null,null,null,null,null,null,null,null,null,null,"3 - 4",0,null,0,0,null,0,0,null,"","",null,null,null,null,null,{"$f":"IF(AND($BU$16=\"?\",$CA$16=$CA$8),\"joueur 1\",\"\")","v":""},null,{"$f":"IF(AND($BW$16=\"?\",$CA$16=$CA$8),\"joueur 2\",\"\")","v":""},null,{"$f":"IF(AND($BY$16=\"?\",$CA$16=$CA$8),\"joueur 3\",\"\")","v":""},null,null,null,null,{"$f":"IF($K$16<>\"\",\"Joueur 1\",\"\")","v":"Joueur 1"},null,{"$f":"IF($K$17<>\"\",\"Joueur 2\",\"\")","v":"Joueur 2"},null,{"$f":"IF($K$18<>\"\",\"Joueur 3\",\"\")","v":"Joueur 3"}]
[7,{"$f":"IF($K$22<>\"\",VLOOKUP($K$22,Liste!$C$30:$I$37,3,FALSE),\"\")","v":"DUBOIS Gilles"},null,null,null,null,null,null,null,null,{"$f":"IF(Poules!$P40<>\"\",Poules!$P40,\"\")","v":15},null,null,{"$f":"IF($K$22<>\"\",VLOOKUP($K$22,Liste!$C$30:$I$37,2,FALSE),\"\")","v":0},null,null,{"$f":"IF($K$22<>\"\",VLOOKUP($K$22,Liste!$C$30:$I$37,4,FALSE),\"\")","v":3},null,{"$f":"IF($K$22<>\"\",VLOOKUP($K$22,Liste!$C$30:$I$37,5,FALSE),\"\")","v":"NO"},null,{"$f":"IF($K$22<>\"\",VLOOKUP($K$22,Liste!$C$30:$I$37,6,FALSE),\"\")","v":0},null,{"$f":"IF($K$22<>\"\",VLOOKUP($K$22,Liste!$C$30:$I$37,7,FALSE),\"\")","v":"LE MANS SARTHE TT"},null,null,null,null,null,null,null,null,null,null,null,null,null,null,null,null,null,null,null,null,null,null,null,null,"1 - 6",0,null,0,0,null,0,0,null,"","",null,null,null,null,{"$f":"IF($BL$21<>\"\",IF($BU$15=$BW$15,\"1 - 2\",\"\"),\"\")","v":""},{"$f":"IF($BK$22<>\"\",$BB$15,\"\")","v":""},{"$f":"IF($BK$22<>\"\",$BC$15,\"\")","v":""},{"$f":"IF($BK$22<>\"\",$BC$15,\"\")","v":""},{"$f":"IF($BK$22<>\"\",$BB$15,\"\")","v":""},null,null,null,"Points",null,{"$f":"IF($BL$25=\"\",$BU$15,($BU$15+($BL$25*0.01)))","v":2},null,{"$f":"IF($BN$25=\"\",$BW$15,($BW$15+($BN$25*0.01)))","v":2},null,{"$f":"IF($BP$25=\"\",$BY$15,($BY$15+($BP$25*0.01)))","v":2},null,{"$f":"IF($BU$23=\"?\",COUNTIF($BU$22:$BZ$22,$BU$22),\"\")","v":""},{"$f":"IF($BW$23=\"?\",COUNTIF($BU$22:$BZ$22,$BW$22),\"\")","v":""},{"$f":"IF($BY$23=\"?\",COUNTIF($BU$22:$BZ$22,$BY$22),\"\")","v":""}]
[8,{"$f":"IF($K$23<>\"\",VLOOKUP($K$23,Liste!$C$30:$I$37,3,FALSE),\"\")","v":"HASLE Stéphane"},null,null,null,null,null,null,null,null,{"$f":"IF(Poules!$P41<>\"\",Poules!$P41,\"\")","v":10},null,null,{"$f":"IF($K$23<>\"\",VLOOKUP($K$23,Liste!$C$30:$I$37,2,FALSE),\"\")","v":0},null,null,{"$f":"IF($K$23<>\"\",VLOOKUP($K$23,Liste!$C$30:$I$37,4,FALSE),\"\")","v":5},null,{"$f":"IF($K$23<>\"\",VLOOKUP($K$23,Liste!$C$30:$I$37,5,FALSE),\"\")","v":"NO"},null,{"$f":"IF($K$23<>\"\",VLOOKUP($K$23,Liste!$C$30:$I$37,6,FALSE),\"\")","v":0},null,{"$f":"IF($K$23<>\"\",VLOOKUP($K$23,Liste!$C$30:$I$37,7,FALSE),\"\")","v":"THORIGNE-FOUILLARD TT"},null,null,null,null,null,null,null,null,null,null,null,null,null,null,null,null,null,null,null,null,null,null,null,null,"5 - 7",0,null,0,0,null,0,0,null,"","",null,null,null,null,{"$f":"IF($BL$21<>\"\",IF($BU$15=$BY$15,\"1 - 3\",\"\"),\"\")","v":""},{"$f":"IF($BK$23<>\"\",BB14,\"\")","v":""},{"$f":"IF($BK$23<>\"\",BC14,\"\")","v":""},null,null,{"$f":"IF($BK$23<>\"\",BC14,\"\")","v":""},{"$f":"IF($BK$23<>\"\",BB14,\"\")","v":""},null,"Rang",null,{"$f":"IF($BL$6<>\"\",IF($AV$10=$AY$10,IF($BU$22=$BW$22,\"?\",IF($BU$22=$BY$22,\"?\",RANK($BU$22,$BU$22:$BZ$22))),\"\"),\"\")","v":""},null,{"$f":"IF($BN$6<>\"\",IF($AV$10=$AY$10,IF($BW$22=$BU$22,\"?\",IF($BW$22=$BY$22,\"?\",RANK($BW$22,$BU$22:$BZ$22))),\"\"),\"\")","v":""},null,{"$f":"IF($BP$6<>\"\",IF($AV$10=$AY$10,IF($BY$22=$BU$22,\"?\",IF($BY$22=$BW$22,\"?\",RANK($BY$22,$BU$22:$BZ$22))),\"\"),\"\")","v":""},null,{"$f":"IF($BU$23<>\"\",SUM($CA$22:$CC$22),\"\")","v":""}]
[null,null,null,null,null,null,null,null,null,null,{"$f":"COUNT(K16:M23)","v":8},null,null,null,null,null,null,null,null,null,null,null,null,null,null,null,null,null,null,null,null,null,null,null,null,"     Parties Tour 4 C",null,null,null,null,null,null,null,null,null,null,null,"4 - 8",0,null,0,0,null,0,0,null,"","",null,null,null,null,{"$f":"IF($BN$21<>\"\",IF($BW$15=$BY$15,\"2 - 3\",\"\"),\"\")","v":""},null,null,{"$f":"IF($BK$24<>\"\",BB16,\"\")","v":""},{"$f":"IF($BK$24<>\"\",BC16,\"\")","v":""},{"$f":"IF($BK$24<>\"\",BC16,\"\")","v":""},{"$f":"IF($BK$24<>\"\",BB16,\"\")","v":""}]
["Table","Heure","Partie",null,null,"A/F (1)","Joueur 1",null,null,null,null,"contre",null,null,"Joueur 2",null,null,null,null,"A/F (1)","Scores",null,null,null,null,"Points parties",null,null,null,null,null,null,null,null,null,null,null,null,null,null,null,null,null,null,null,null,null,"2 - 3",1,null,1,0,null,0,3,null,0,2,null,null,null,null,"Total",{"$f":"IF($BL$21<>\"\",(SUM($BL$22:$BL$24)/SUM($BM$22:$BM$24)),\"\")","v":""},null,{"$f":"IF($BN$21<>\"\",(SUM($BN$22:$BN$24)/SUM($BO$22:$BO$24)),\"\")","v":""},null,{"$f":"IF($BP$21<>\"\",(SUM($BP$22:$BP$24)/SUM($BQ$22:$BQ$24)),\"\")","v":""}]
[null,null,null,null,null,null,null,null,null,null,null,null,null,null,null,null,null,null,null,null,1,2,3,4,5,"J1","J2","J3","J4","J5","J6","J7","J8",null,null,null,null,null,null,null,null,null,null,null,null,null,null,"1 - 5",0,null,0,0,null,0,0,null,"",""]
[{"$f":"IF(Prépa!$AE$6<>\"\",Prépa!$AE$6,\"\")","v":5},{"$f":"IF(Prépa!$AD$6<>\"\",Prépa!$AD$6,\"\")","v":"9h30"},{"$f":"IF($K$16<>\"\",$A$16,\"\")","v":1},"-",{"$f":"IF($K$23<>\"\",$A$23,\"\")","v":8},null,{"$f":"IF($C27<>\"\",VLOOKUP($C27,$A$16:$J$23,2,FALSE),\"\")","v":"PAPIRER Alan"},null,null,null,null,null,"-",{"$f":"IF($E27<>\"\",VLOOKUP($E27,$A$16:$J$23,2,FALSE),\"\")","v":"HASLE Stéphane"},null,null,null,null,null,null,null,null,null,null,null,{"$f":"IF($AY14=1,0,IF($AZ14=1,2,IF($BB14<>\"\",IF($BB14=3,2,IF($BC14=3,1,\"\")),\"\")))","v":""},null,null,null,null,null,null,{"$f":"IF($AZ14=1,0,IF($AY14=1,2,IF($BC14<>\"\",IF($BC14=3,2,IF($BB14=3,1,\"\")),\"\")))","v":""},null,null,"     Parties Tour 5 C",null,null,null,null,null,null,null,null,null,null,null,"4 - 6",0,null,0,0,null,0,0,null,"","",null,null,null,null,"Départage aux points Niveau 1",null,null,null,null,null,null,null,"Clt après départage au points"]
[{"$f":"IF(Prépa!$AE$7<>\"\",Prépa!$AE$7,\"\")","v":6},{"$f":"IF(Prépa!$AD$7<>\"\",Prépa!$AD$7,\"\")","v":"9h30"},{"$f":"IF($K$17<>\"\",$A$17,\"\")","v":2},"-",{"$f":"IF($K$22<>\"\",$A$22,\"\")","v":7},"F",{"$f":"IF($C28<>\"\",VLOOKUP($C28,$A$16:$J$23,2,FALSE),\"\")","v":"HENOUX Frédéric"},null,null,null,null,null,"-",{"$f":"IF($E28<>\"\",VLOOKUP($E28,$A$16:$J$23,2,FALSE),\"\")","v":"DUBOIS Gilles"},null,null,null,null,null,null,null,null,null,null,null,null,{"$f":"IF($AY15=1,0,IF($AZ15=1,2,IF($BB15<>\"\",IF($BB15=3,2,IF($BC15=3,1,\"\")),\"\")))","v":0},null,null,null,null,{"$f":"IF($AZ15=1,0,IF($AY15=1,2,IF($BC15<>\"\",IF($BC15=3,2,IF($BB15=3,1,\"\")),\"\")))","v":2},null,null,null,null,null,null,null,null,null,null,null,null,null,null,null,"3 - 7",0,null,0,0,null,0,0,null,"","",null,null,null,null,null,{"$f":"IF(AND($BU$23=\"?\",$CA$23=$CA$8),\"joueur 1\",\"\")","v":""},null,{"$f":"IF(AND($BW$23=\"?\",$CA$23=$CA$8),\"joueur 2\",\"\")","v":""},null,{"$f":"IF(AND($BY$23=\"?\",$CA$23=$CA$8),\"joueur 3\",\"\")","v":""},null,null,null,null,{"$f":"IF($K$16<>\"\",\"Joueur 1\",\"\")","v":"Joueur 1"},null,{"$f":"IF($K$17<>\"\",\"Joueur 2\",\"\")","v":"Joueur 2"},null,{"$f":"IF($K$18<>\"\",\"Joueur 3\",\"\")","v":"Joueur 3"}]
[{"$f":"IF(Prépa!$AE$8<>\"\",Prépa!$AE$8,\"\")","v":7},{"$f":"IF(Prépa!$AD$8<>\"\",Prépa!$AD$8,\"\")","v":"9h30"},{"$f":"IF($K$18<>\"\",$A$18,\"\")","v":3},"-",{"$f":"IF($K$21<>\"\",$A$21,\"\")","v":6},null,"ADJAL Yorick",null,null,null,null,null,"-","SIREAU GOSSIAUX Florence",null,null,null,null,null,null,null,null,null,null,null,null,null,{"$f":"IF($AY16=1,0,IF($AZ16=1,2,IF($BB16<>\"\",IF($BB16=3,2,IF($BC16=3,1,\"\")),\"\")))","v":""},null,null,{"$f":"IF($AZ16=1,0,IF($AY16=1,2,IF($BC16<>\"\",IF($BC16=3,2,IF($BB16=3,1,\"\")),\"\")))","v":""},null,null,null,null,null,null,null,null,null,null,null,null,null,null,null,null,"2 - 8",0,null,1,0,null,0,3,null,0,2,null,null,null,null,{"$f":"IF($BL$28<>\"\",IF($BU$22=$BW$22,\"1 - 2\",\"\"),\"\")","v":""},{"$f":"IF($BK$29<>\"\",$AZ$54,\"\")","v":""},{"$f":"IF($BK$29<>\"\",$BA$54,\"\")","v":""},{"$f":"IF($BK$29<>\"\",$BA$54,\"\")","v":""},{"$f":"IF($BK$29<>\"\",$AZ$54,\"\")","v":""},null,null,null,"Points",null,{"$f":"IF($BL$32=\"\",$BU$22,($BU$22+($BL$32*0.001)))","v":2},null,{"$f":"IF($BN$32=\"\",$BW$22,($BW$22+($BN$32*0.001)))","v":2},null,{"$f":"IF($BP$32=\"\",$BY$22,($BY$22+($BP$32*0.001)))","v":2},null,{"$f":"IF($BU$30=\"?\",COUNTIF($BU$29:$BZ$29,$BU$29),\"\")","v":""},{"$f":"IF($BW$30=\"?\",COUNTIF($BU$29:$BZ$29,$BW$29),\"\")","v":""},{"$f":"IF($BY$30=\"?\",COUNTIF($BU$23:$BZ$23,$BY$29),\"\")","v":""}]
[{"$f":"IF(Prépa!$AE$9<>\"\",Prépa!$AE$9,\"\")","v":8},{"$f":"IF(Prépa!$AD$9<>\"\",Prépa!$AD$9,\"\")","v":"9h30"},{"$f":"IF($K$19<>\"\",$A$19,\"\")","v":4},"-",{"$f":"IF($K$20<>\"\",$A$20,\"\")","v":5},null,"KERGOSIEN Arnaud",null,null,null,null,null,"-","BELTRAND Arnaud",null,null,null,null,null,null,null,null,null,null,null,null,null,null,{"$f":"IF($AY17=1,0,IF($AZ17=1,2,IF($BB17<>\"\",IF($BB17=3,2,IF($BC17=3,1,\"\")),\"\")))","v":""},{"$f":"IF($AZ17=1,0,IF($AY17=1,2,IF($BC17<>\"\",IF($BC17=3,2,IF($BB17=3,1,\"\")),\"\")))","v":""},null,null,null,null,null,"     Parties Tour 6 C",null,null,null,null,null,null,null,null,null,null,null,"1 - 4",0,null,0,0,null,0,0,null,"","",null,null,null,null,{"$f":"IF($BL$28<>\"\",IF($BU$22=$BY$22,\"1 - 3\",\"\"),\"\")","v":""},{"$f":"IF($BK$30<>\"\",AZ53,\"\")","v":""},{"$f":"IF($BK$30<>\"\",BA53,\"\")","v":""},null,null,{"$f":"IF($BK$30<>\"\",BA53,\"\")","v":""},{"$f":"IF($BK$30<>\"\",AZ53,\"\")","v":""},null,"Rang",null,{"$f":"IF($BL$6<>\"\",IF($AV$10=$AY$10,IF($BU$29=$BW$29,\"?\",IF($BU$29=$BY$29,\"?\",RANK($BU$29,$BU$29:$BZ$29))),\"\"),\"\")","v":""},null,{"$f":"IF($BN$6<>\"\",IF($AV$10=$AY$10,IF($BW$29=$BU$29,\"?\",IF($BW$29=$BY$29,\"?\",RANK($BW$29,$BU$29:$BZ$29))),\"\"),\"\")","v":""},null,{"$f":"IF($BP$6<>\"\",IF($AV$10=$AY$10,IF($BY$29=$BU$29,\"?\",IF($BY$29=$BW$29,\"?\",RANK($BY$29,$BU$29:$BZ$29))),\"\"),\"\")","v":""},null,{"$f":"IF($BU$30<>\"\",SUM($CA$29:$CC$29),\"\")","v":""}]
[{"$f":"IF(Prépa!$AE$13<>\"\",Prépa!$AE$13,\"\")","v":1},{"$f":"IF(Prépa!$AD$13<>\"\",Prépa!$AD$13,\"\")","v":"10h30"},{"$f":"IF($K$16<>\"\",$A$16,\"\")","v":1},"-",{"$f":"IF($K$22<>\"\",$A$22,\"\")","v":7},null,"PAPIRER Alan",null,null,null,null,null,"-","DUBOIS Gilles",null,null,null,null,null,null,null,null,null,null,null,{"$f":"IF($AY18=1,0,IF($AZ18=1,2,IF($BB18<>\"\",IF($BB18=3,2,IF($BC18=3,1,\"\")),\"\")))","v":""},null,null,null,null,null,{"$f":"IF($AZ18=1,0,IF($AY18=1,2,IF($BC18<>\"\",IF($BC18=3,2,IF($BB18=3,1,\"\")),\"\")))","v":""},null,null,null,null,null,null,null,null,null,null,null,null,null,null,null,"3 - 5",0,null,0,0,null,0,0,null,"","",null,null,null,null,{"$f":"IF($BN$28<>\"\",IF($BW$22=$BY$22,\"2 - 3\",\"\"),\"\")","v":""},null,null,{"$f":"IF($BK$31<>\"\",AZ55,\"\")","v":""},{"$f":"IF($BK$31<>\"\",BA55,\"\")","v":""},{"$f":"IF($BK$31<>\"\",BA55,\"\")","v":""},{"$f":"IF($BK$31<>\"\",AZ55,\"\")","v":""}]
[{"$f":"IF(Prépa!$AE$14<>\"\",Prépa!$AE$14,\"\")","v":2},{"$f":"IF(Prépa!$AD$14<>\"\",Prépa!$AD$14,\"\")","v":"10h30"},{"$f":"IF($K$21<>\"\",$A$21,\"\")","v":6},"-",{"$f":"IF($K$23<>\"\",$A$23,\"\")","v":8},null,"SIREAU GOSSIAUX Florence",null,null,null,null,null,"-","HASLE Stéphane",null,null,null,null,null,null,null,null,null,null,null,null,null,null,null,null,{"$f":"IF($AY19=1,0,IF($AZ19=1,2,IF($BB19<>\"\",IF($BB19=3,2,IF($BC19=3,1,\"\")),\"\")))","v":""},null,{"$f":"IF($AZ19=1,0,IF($AY19=1,2,IF($BC19<>\"\",IF($BC19=3,2,IF($BB19=3,1,\"\")),\"\")))","v":""},null,null,null,null,null,null,null,null,null,null,null,null,null,null,"2 - 6",0,null,1,0,null,0,3,null,0,2,null,null,null,null,"Total",{"$f":"IF($BL$28<>\"\",(SUM($BL$29:$BL$31)/SUM($BM$29:$BM$31)),\"\")","v":""},null,{"$f":"IF($BN$28<>\"\",(SUM($BN$29:$BN$31)/SUM($BO$29:$BO$31)),\"\")","v":""},null,{"$f":"IF($BP$28<>\"\",(SUM($BP$29:$BP$31)/SUM($BQ$29:$BQ$31)),\"\")","v":""}]
[{"$f":"IF(Prépa!$AE$15<>\"\",Prépa!$AE$15,\"\")","v":3},{"$f":"IF(Prépa!$AD$15<>\"\",Prépa!$AD$15,\"\")","v":"10h30"},{"$f":"IF($K$17<>\"\",$A$17,\"\")","v":2},"-",{"$f":"IF($K$20<>\"\",$A$20,\"\")","v":5},"F","HENOUX Frédéric",null,null,null,null,null,"-","BELTRAND Arnaud",null,null,null,null,null,null,null,null,null,null,null,null,{"$f":"IF($AY20=1,0,IF($AZ20=1,2,IF($BB20<>\"\",IF($BB20=3,2,IF($BC20=3,1,\"\")),\"\")))","v":0},null,null,{"$f":"IF($AZ20=1,0,IF($AY20=1,2,IF($BC20<>\"\",IF($BC20=3,2,IF($BB20=3,1,\"\")),\"\")))","v":2},null,null,null,null,null,"     Parties Tour 7 C",null,null,null,null,null,null,null,null,null,null,null,"7 - 8",0,null,0,0,null,0,0,null,"",""]
[{"$f":"IF(Prépa!$AE$16<>\"\",Prépa!$AE$16,\"\")","v":4},{"$f":"IF(Prépa!$AD$16<>\"\",Prépa!$AD$16,\"\")","v":"10h30"},{"$f":"IF($K$18<>\"\",$A$18,\"\")","v":3},"-",{"$f":"IF($K$19<>\"\",$A$19,\"\")","v":4},null,"ADJAL Yorick",null,null,null,null,null,"-","KERGOSIEN Arnaud",null,null,null,null,null,null,null,null,null,null,null,null,null,{"$f":"IF($AY21=1,0,IF($AZ21=1,2,IF($BB21<>\"\",IF($BB21=3,2,IF($BC21=3,1,\"\")),\"\")))","v":""},{"$f":"IF($AZ21=1,0,IF($AY21=1,2,IF($BC21<>\"\",IF($BC21=3,2,IF($BB21=3,1,\"\")),\"\")))","v":""},null,null,null,null,null,null,null,null,null,null,null,null,null,null,null,null,null,null,"1 - 3",0,null,0,0,null,0,0,null,"","",null,null,null,null,null,"Classement après 3ème départage"]
[{"$f":"IF(Prépa!$AE$20<>\"\",Prépa!$AE$20,\"\")","v":6},{"$f":"IF(Prépa!$AD$20<>\"\",Prépa!$AD$20,\"\")","v":"11h30"},{"$f":"IF($K$16<>\"\",$A$16,\"\")","v":1},"-",{"$f":"IF($K$21<>\"\",$A$21,\"\")","v":6},null,"PAPIRER Alan",null,null,null,null,null,"-","SIREAU GOSSIAUX Florence",null,null,null,null,null,null,null,null,null,null,null,{"$f":"IF($AY22=1,0,IF($AZ22=1,2,IF($BB22<>\"\",IF($BB22=3,2,IF($BC22=3,1,\"\")),\"\")))","v":""},null,null,null,null,{"$f":"IF($AZ22=1,0,IF($AY22=1,2,IF($BC22<>\"\",IF($BC22=3,2,IF($BB22=3,1,\"\")),\"\")))","v":""},null,null,null,null,null,null,null,null,null,null,null,null,null,null,null,null,"2 - 4",0,null,1,0,null,0,3,null,0,2,null,null,null,null,null,"Joueur 1",null,"Joueur 2",null,"Joueur 3"]
[{"$f":"IF(Prépa!$AE$21<>\"\",Prépa!$AE$21,\"\")","v":7},{"$f":"IF(Prépa!$AD$21<>\"\",Prépa!$AD$21,\"\")","v":"11h30"},{"$f":"IF($K$20<>\"\",$A$20,\"\")","v":5},"-",{"$f":"IF($K$22<>\"\",$A$22,\"\")","v":7},null,"BELTRAND Arnaud",null,null,null,null,null,"-","DUBOIS Gilles",null,null,null,null,null,null,null,null,null,null,null,null,null,null,null,{"$f":"IF($AY23=1,0,IF($AZ23=1,2,IF($BB23<>\"\",IF($BB23=3,2,IF($BC23=3,1,\"\")),\"\")))","v":""},null,{"$f":"IF($AZ23=1,0,IF($AY23=1,2,IF($BC23<>\"\",IF($BC23=3,2,IF($BB23=3,1,\"\")),\"\")))","v":""},null,null,null,null,1,null,null,null,null,null,null,null,null,null,null,"5 - 8",0,null,0,0,null,0,0,null,"","",null,null,null,null,null,{"$f":"IF($BU$29<>\"\",$BU$29,\"\")","v":2},null,{"$f":"IF($BW$29<>\"\",$BW$29,\"\")","v":2},null,{"$f":"IF($BY$29<>\"\",$BY$29,\"\")","v":2}]
[{"$f":"IF(Prépa!$AE$22<>\"\",Prépa!$AE$22,\"\")","v":8},{"$f":"IF(Prépa!$AD$22<>\"\",Prépa!$AD$22,\"\")","v":"11h30"},{"$f":"IF($K$19<>\"\",$A$19,\"\")","v":4},"-",{"$f":"IF($K$23<>\"\",$A$23,\"\")","v":8},null,"KERGOSIEN Arnaud",null,null,null,null,null,"-","HASLE Stéphane",null,null,null,null,null,null,null,null,null,null,null,null,null,null,{"$f":"IF($AY24=1,0,IF($AZ24=1,2,IF($BB24<>\"\",IF($BB24=3,2,IF($BC24=3,1,\"\")),\"\")))","v":""},null,null,null,{"$f":"IF($AZ24=1,0,IF($AY24=1,2,IF($BC24<>\"\",IF($BC24=3,2,IF($BB24=3,1,\"\")),\"\")))","v":""},null,null,null,null,null,null,null,null,null,null,null,null,null,null,"6 - 7",0,null,0,0,null,0,0,null,"","",null,null,null,null,null,{"$f":"IF($BU$30<>\"\",$BU$30,\"\")","v":""},null,{"$f":"IF($BW$30<>\"\",$BW$30,\"\")","v":""},null,{"$f":"IF($BY$30<>\"\",$BY$30,\"\")","v":""}]
[{"$f":"IF(Prépa!$AE$23<>\"\",Prépa!$AE$23,\"\")","v":5},{"$f":"IF(Prépa!$AD$23<>\"\",Prépa!$AD$23,\"\")","v":"11h30"},{"$f":"IF($K$17<>\"\",$A$17,\"\")","v":2},"-",{"$f":"IF($K$18<>\"\",$A$18,\"\")","v":3},"F","HENOUX Frédéric",null,null,null,null,null,"-","ADJAL Yorick",null,null,null,null,null,null,null,null,null,null,null,null,{"$f":"IF($AY25=1,0,IF($AZ25=1,2,IF($BB25<>\"\",IF($BB25=3,2,IF($BC25=3,1,\"\")),\"\")))","v":0},{"$f":"IF($AZ25=1,0,IF($AY25=1,2,IF($BC25<>\"\",IF($BC25=3,2,IF($BB25=3,1,\"\")),\"\")))","v":2},null,null,null,null,null,null,null,null,"    Débloquer C",null,null,null,null,null,null,null,null,null,null,"1 - 2",0,null,0,1,null,3,0,null,2,0]
[{"$f":"IF(Prépa!$AE$27<>\"\",Prépa!$AE$27,\"\")","v":2},{"$f":"IF(Prépa!$AD$27<>\"\",Prépa!$AD$27,\"\")","v":"13h30"},{"$f":"IF($K$16<>\"\",$A$16,\"\")","v":1},"-",{"$f":"IF($K$20<>\"\",$A$20,\"\")","v":5},null,"PAPIRER Alan",null,null,null,null,null,"-","BELTRAND Arnaud",null,null,null,null,null,null,null,null,null,null,null,{"$f":"IF($AY26=1,0,IF($AZ26=1,2,IF($BB26<>\"\",IF($BB26=3,2,IF($BC26=3,1,\"\")),\"\")))","v":""},null,null,null,{"$f":"IF($AZ26=1,0,IF($AY26=1,2,IF($BC26<>\"\",IF($BC26=3,2,IF($BB26=3,1,\"\")),\"\")))","v":""},null,null,null,null,null,null,null,null,null,null,null,null,null,null,null,null,null,"3 - 8",0,null,0,0,null,0,0,null,"",""]
[{"$f":"IF(Prépa!$AE$28<>\"\",Prépa!$AE$28,\"\")","v":3},{"$f":"IF(Prépa!$AD$28<>\"\",Prépa!$AD$28,\"\")","v":"13h30"},{"$f":"IF($K$19<>\"\",$A$19,\"\")","v":4},"-",{"$f":"IF($K$21<>\"\",$A$21,\"\")","v":6},null,"KERGOSIEN Arnaud",null,null,null,null,null,"-","SIREAU GOSSIAUX Florence",null,null,null,null,null,null,null,null,null,null,null,null,null,null,{"$f":"IF($AY27=1,0,IF($AZ27=1,2,IF($BB27<>\"\",IF($BB27=3,2,IF($BC27=3,1,\"\")),\"\")))","v":""},null,{"$f":"IF($AZ27=1,0,IF($AY27=1,2,IF($BC27<>\"\",IF($BC27=3,2,IF($BB27=3,1,\"\")),\"\")))","v":""},null,null,null,null,null,null,null,null,null,null,null,null,null,null,null,null,"4 - 7",0,null,0,0,null,0,0,null,"",""]
[{"$f":"IF(Prépa!$AE$29<>\"\",Prépa!$AE$29,\"\")","v":4},{"$f":"IF(Prépa!$AD$29<>\"\",Prépa!$AD$29,\"\")","v":"13h30"},{"$f":"IF($K$18<>\"\",$A$18,\"\")","v":3},"-",{"$f":"IF($K$22<>\"\",$A$22,\"\")","v":7},null,"ADJAL Yorick",null,null,null,null,null,"-","DUBOIS Gilles",null,null,null,null,null,null,null,null,null,null,null,null,null,{"$f":"IF($AY28=1,0,IF($AZ28=1,2,IF($BB28<>\"\",IF($BB28=3,2,IF($BC28=3,1,\"\")),\"\")))","v":""},null,null,null,{"$f":"IF($AZ28=1,0,IF($AY28=1,2,IF($BC28<>\"\",IF($BC28=3,2,IF($BB28=3,1,\"\")),\"\")))","v":""},null,null,null,null,"   RAZ C",null,null,null,null,null,null,null,null,null,null,"5 - 6",0,null,0,0,null,0,0,null,"",""]
[{"$f":"IF(Prépa!$AE$30<>\"\",Prépa!$AE$30,\"\")","v":1},{"$f":"IF(Prépa!$AD$30<>\"\",Prépa!$AD$30,\"\")","v":"13h30"},{"$f":"IF($K$17<>\"\",$A$17,\"\")","v":2},"-",{"$f":"IF($K$23<>\"\",$A$23,\"\")","v":8},"F","HENOUX Frédéric",null,null,null,null,null,"-","HASLE Stéphane",null,null,null,null,null,null,null,null,null,null,null,null,{"$f":"IF($AY29=1,0,IF($AZ29=1,2,IF($BB29<>\"\",IF($BB29=3,2,IF($BC29=3,1,\"\")),\"\")))","v":0},null,null,null,null,null,{"$f":"IF($AZ29=1,0,IF($AY29=1,2,IF($BC29<>\"\",IF($BC29=3,2,IF($BB29=3,1,\"\")),\"\")))","v":2}]
[{"$f":"IF(Prépa!$AE$34<>\"\",Prépa!$AE$34,\"\")","v":7},{"$f":"IF(Prépa!$AD$34<>\"\",Prépa!$AD$34,\"\")","v":"14h30"},{"$f":"IF($K$16<>\"\",$A$16,\"\")","v":1},"-",{"$f":"IF($K$19<>\"\",$A$19,\"\")","v":4},null,"PAPIRER Alan",null,null,null,null,null,"-","KERGOSIEN Arnaud",null,null,null,null,null,null,null,null,null,null,null,{"$f":"IF($AY30=1,0,IF($AZ30=1,2,IF($BB30<>\"\",IF($BB30=3,2,IF($BC30=3,1,\"\")),\"\")))","v":""},null,null,{"$f":"IF($AZ30=1,0,IF($AY30=1,2,IF($BC30<>\"\",IF($BC30=3,2,IF($BB30=3,1,\"\")),\"\")))","v":""}]
[{"$f":"IF(Prépa!$AE$35<>\"\",Prépa!$AE$35,\"\")","v":8},{"$f":"IF(Prépa!$AD$35<>\"\",Prépa!$AD$35,\"\")","v":"14h30"},{"$f":"IF($K$18<>\"\",$A$18,\"\")","v":3},"-",{"$f":"IF($K$20<>\"\",$A$20,\"\")","v":5},null,"ADJAL Yorick",null,null,null,null,null,"-","BELTRAND Arnaud",null,null,null,null,null,null,null,null,null,null,null,null,null,{"$f":"IF($AY31=1,0,IF($AZ31=1,2,IF($BB31<>\"\",IF($BB31=3,2,IF($BC31=3,1,\"\")),\"\")))","v":""},null,{"$f":"IF($AZ31=1,0,IF($AY31=1,2,IF($BC31<>\"\",IF($BC31=3,2,IF($BB31=3,1,\"\")),\"\")))","v":""}]
[{"$f":"IF(Prépa!$AE$36<>\"\",Prépa!$AE$36,\"\")","v":5},{"$f":"IF(Prépa!$AD$36<>\"\",Prépa!$AD$36,\"\")","v":"14h30"},{"$f":"IF($K$17<>\"\",$A$17,\"\")","v":2},"-",{"$f":"IF($K$21<>\"\",$A$21,\"\")","v":6},"F","HENOUX Frédéric",null,null,null,null,null,"-","SIREAU GOSSIAUX Florence",null,null,null,null,null,null,null,null,null,null,null,null,{"$f":"IF($AY32=1,0,IF($AZ32=1,2,IF($BB32<>\"\",IF($BB32=3,2,IF($BC32=3,1,\"\")),\"\")))","v":0},null,null,null,{"$f":"IF($AZ32=1,0,IF($AY32=1,2,IF($BC32<>\"\",IF($BC32=3,2,IF($BB32=3,1,\"\")),\"\")))","v":2},null,null,null,null,null,null,null,null,null,null,null,null,null,null,null,null,"Points"]
[{"$f":"IF(Prépa!$AE$37<>\"\",Prépa!$AE$37,\"\")","v":6},{"$f":"IF(Prépa!$AD$37<>\"\",Prépa!$AD$37,\"\")","v":"14h30"},{"$f":"IF($K$22<>\"\",$A$22,\"\")","v":7},"-",{"$f":"IF($K$23<>\"\",$A$23,\"\")","v":8},null,"DUBOIS Gilles",null,null,null,null,null,"-","HASLE Stéphane",null,null,null,null,null,null,null,null,null,null,null,null,null,null,null,null,null,{"$f":"IF($AY33=1,0,IF($AZ33=1,2,IF($BB33<>\"\",IF($BB33=3,2,IF($BC33=3,1,\"\")),\"\")))","v":""},{"$f":"IF($AZ33=1,0,IF($AY33=1,2,IF($BC33<>\"\",IF($BC33=3,2,IF($BB33=3,1,\"\")),\"\")))","v":""},null,null,null,null,null,null,null,null,null,null,null,null,null,null,"Manche 1",null,"Manche 2",null,"Manche 3",null,"Manche 4",null,"Manche 5",null,"J1","J2"]
[{"$f":"IF(Prépa!$AE$41<>\"\",Prépa!$AE$41,\"\")","v":3},{"$f":"IF(Prépa!$AD$41<>\"\",Prépa!$AD$41,\"\")","v":"15h30"},{"$f":"IF($K$16<>\"\",$A$16,\"\")","v":1},"-",{"$f":"IF($K$18<>\"\",$A$18,\"\")","v":3},null,"PAPIRER Alan",null,null,null,null,null,"-","ADJAL Yorick",null,null,null,null,null,null,null,null,null,null,null,{"$f":"IF($AY34=1,0,IF($AZ34=1,2,IF($BB34<>\"\",IF($BB34=3,2,IF($BC34=3,1,\"\")),\"\")))","v":""},null,{"$f":"IF($AZ34=1,0,IF($AY34=1,2,IF($BC34<>\"\",IF($BC34=3,2,IF($BB34=3,1,\"\")),\"\")))","v":""},null,null,null,null,null,null,null,null,null,null,null,null,null,null,null,null,null,null,null,{"$f":"IF(AND($AZ$14=1,$U$27=\"\"),11,IF($U$27<0.1,-$U$27,IF(AND($U$27>-0.1,$U$27<10),11,($U$27+2))))","v":0},{"$f":"IF(AND($AY$14=1,$U$27=\"\"),11,IF($U$27>-0.1,$U$27,IF(AND($U$27<0.1,$U$27>-10),11,(-$U$27+2))))","v":0},{"$f":"IF(AND($AZ$14=1,$V$27=\"\"),11,IF($V$27<0.1,-$V$27,IF(AND($V$27>-0.1,$V$27<10),11,($V$27+2))))","v":0},{"$f":"IF(AND($AY$14=1,$V$27=\"\"),11,IF($V$27>-0.1,$V$27,IF(AND($V$27<0.1,$V$27>-10),11,(-$V$27+2))))","v":0},{"$f":"IF(AND($AZ$14=1,$W$27=\"\"),11,IF($W$27<0.1,-$W$27,IF(AND($W$27>-0.1,$W$27<10),11,($W$27+2))))","v":0},{"$f":"IF(AND($AY$14=1,$W$27=\"\"),11,IF($W$27>-0.1,$W$27,IF(AND($W$27<0.1,$W$27>-10),11,(-$W$27+2))))","v":0},{"$f":"IF(AND($AZ$14=1,$X$27=\"\"),11,IF($X$27<0.1,-$X$27,IF(AND($X$27>-0.1,$X$27<10),11,($X$27+2))))","v":0},{"$f":"IF(AND($AY$14=1,$X$27=\"\"),11,IF($X$27>-0.1,$X$27,IF(AND($X$27<0.1,$X$27>-10),11,(-$X$27+2))))","v":0},{"$f":"IF(AND($AZ$14=1,$Y$27=\"\"),11,IF($Y$27<0.1,-$Y$27,IF(AND($Y$27>-0.1,$Y$27<10),11,($Y$27+2))))","v":0},{"$f":"IF(AND($AY$14=1,$Y$27=\"\"),11,IF($Y$27>-0.1,$Y$27,IF(AND($Y$27<0.1,$Y$27>-10),11,(-$Y$27+2))))","v":0},{"$f":"IF($BB$14+$BC$14>2,IF($BB$14+$BC$14=3,$AV$47+$AX$47+$AZ$47,IF($BB$14+$BC$14=4,$AV$47+$AX$47+$AZ$47+$BB$47,IF($BB$14+$BC$14=5,$AV$47+$AX$47+$AZ$47+$BB$47+$BD$47,\"\"))),\"\")","v":""},{"$f":"IF($BB$14+$BC$14>2,IF($BB$14+$BC$14=3,$AW$47+$AY$47+$BA$47,IF($BB$14+$BC$14=4,$AW$47+$AY$47+$BA$47+$BC$47,IF($BB$14+$BC$14=5,$AW$47+$AY$47+$BA$47+$BC$47+$BE$47,\"\"))),\"\")","v":""}]
[{"$f":"IF(Prépa!$AE$42<>\"\",Prépa!$AE$42,\"\")","v":4},{"$f":"IF(Prépa!$AD$42<>\"\",Prépa!$AD$42,\"\")","v":"15h30"},{"$f":"IF($K$17<>\"\",$A$17,\"\")","v":2},"-",{"$f":"IF($K$19<>\"\",$A$19,\"\")","v":4},"F","HENOUX Frédéric",null,null,null,null,null,"-","KERGOSIEN Arnaud",null,null,null,null,null,null,null,null,null,null,null,null,{"$f":"IF($AY35=1,0,IF($AZ35=1,2,IF($BB35<>\"\",IF($BB35=3,2,IF($BC35=3,1,\"\")),\"\")))","v":0},null,{"$f":"IF($AZ35=1,0,IF($AY35=1,2,IF($BC35<>\"\",IF($BC35=3,2,IF($BB35=3,1,\"\")),\"\")))","v":2},null,null,null,null,null,null,null,null,null,null,null,null,null,null,null,null,null,null,{"$f":"IF(AND($AZ$15=1,$U$28=\"\"),11,IF($U$28<0.1,-$U$28,IF(AND($U$28>-0.1,$U$28<10),11,($U$28+2))))","v":0},{"$f":"IF(AND($AY$15=1,$U$28=\"\"),11,IF($U$28>-0.1,$U$28,IF(AND($U$28<0.1,$U$28>-10),11,(-$U$28+2))))","v":11},{"$f":"IF(AND($AZ$15=1,$V$28=\"\"),11,IF($V$28<0.1,-$V$28,IF(AND($V$28>-0.1,$V$28<10),11,($V$28+2))))","v":0},{"$f":"IF(AND($AY$15=1,$V$28=\"\"),11,IF($V$28>-0.1,$V$28,IF(AND($V$28<0.1,$V$28>-10),11,(-$V$28+2))))","v":11},{"$f":"IF(AND($AZ$15=1,$W$28=\"\"),11,IF($W$28<0.1,-$W$28,IF(AND($W$28>-0.1,$W$28<10),11,($W$28+2))))","v":0},{"$f":"IF(AND($AY$15=1,$W$28=\"\"),11,IF($W$28>-0.1,$W$28,IF(AND($W$28<0.1,$W$28>-10),11,(-$W$28+2))))","v":11},{"$f":"IF(AND($AZ$15=1,$X$28=\"\"),11,IF($X$28<0.1,-$X$28,IF(AND($X$28>-0.1,$X$28<10),11,($X$28+2))))","v":0},{"$f":"IF(AND($AY$15=1,$X$28=\"\"),11,IF($X$28>-0.1,$X$28,IF(AND($X$28<0.1,$X$28>-10),11,(-$X$28+2))))","v":11},{"$f":"IF(AND($AZ$15=1,$Y$28=\"\"),11,IF($Y$28<0.1,-$Y$28,IF(AND($Y$28>-0.1,$Y$28<10),11,($Y$28+2))))","v":0},{"$f":"IF(AND($AY$15=1,$Y$28=\"\"),11,IF($Y$28>-0.1,$Y$28,IF(AND($Y$28<0.1,$Y$28>-10),11,(-$Y$28+2))))","v":11},{"$f":"IF($BB$15+$BC$15>2,IF($BB$15+$BC$15=3,$AV$48+$AX$48+$AZ$48,IF($BB$15+$BC$15=4,$AV$48+$AX$48+$AZ$48+$BB$48,IF($BB$15+$BC$15=5,$AV$48+$AX$48+$AZ$48+$BB$48+$BD$48,\"\"))),\"\")","v":0},{"$f":"IF($BB$15+$BC$15>2,IF($BB$15+$BC$15=3,$AW$48+$AY$48+$BA$48,IF($BB$15+$BC$15=4,$AW$48+$AY$48+$BA$48+$BC$48,IF($BB$15+$BC$15=5,$AW$48+$AY$48+$BA$48+$BC$48+$BE$48,\"\"))),\"\")","v":33}]
[{"$f":"IF(Prépa!$AE$43<>\"\",Prépa!$AE$43,\"\")","v":1},{"$f":"IF(Prépa!$AD$43<>\"\",Prépa!$AD$43,\"\")","v":"15h30"},{"$f":"IF($K$20<>\"\",$A$20,\"\")","v":5},"-",{"$f":"IF($K$23<>\"\",$A$23,\"\")","v":8},null,"BELTRAND Arnaud",null,null,null,null,null,"-","HASLE Stéphane",null,null,null,null,null,null,null,null,null,null,null,null,null,null,null,{"$f":"IF($AY36=1,0,IF($AZ36=1,2,IF($BB36<>\"\",IF($BB36=3,2,IF($BC36=3,1,\"\")),\"\")))","v":""},null,null,{"$f":"IF($AZ36=1,0,IF($AY36=1,2,IF($BC36<>\"\",IF($BC36=3,2,IF($BB36=3,1,\"\")),\"\")))","v":""},null,null,null,null,null,null,null,null,null,null,null,null,null,null,{"$f":"IF(AND($AZ$16=1,$U$29=\"\"),11,IF($U$29<0.1,-$U$29,IF(AND($U$29>-0.1,$U$29<10),11,($U$29+2))))","v":0},{"$f":"IF(AND($AY$16=1,$U$29=\"\"),11,IF($U$29>-0.1,$U$29,IF(AND($U$29<0.1,$U$29>-10),11,(-$U$29+2))))","v":0},{"$f":"IF(AND($AZ$16=1,$V$29=\"\"),11,IF($V$29<0.1,-$V$29,IF(AND($V$29>-0.1,$V$29<10),11,($V$29+2))))","v":0},{"$f":"IF(AND($AY$16=1,$V$29=\"\"),11,IF($V$29>-0.1,$V$29,IF(AND($V$29<0.1,$V$29>-10),11,(-$V$29+2))))","v":0},{"$f":"IF(AND($AZ$16=1,$W$29=\"\"),11,IF($W$29<0.1,-$W$29,IF(AND($W$29>-0.1,$W$29<10),11,($W$29+2))))","v":0},{"$f":"IF(AND($AY$16=1,$W$29=\"\"),11,IF($W$29>-0.1,$W$29,IF(AND($W$29<0.1,$W$29>-10),11,(-$W$29+2))))","v":0},{"$f":"IF(AND($AZ$16=1,$X$29=\"\"),11,IF($X$29<0.1,-$X$29,IF(AND($X$29>-0.1,$X$29<10),11,($X$29+2))))","v":0},{"$f":"IF(AND($AY$16=1,$X$29=\"\"),11,IF($X$29>-0.1,$X$29,IF(AND($X$29<0.1,$X$29>-10),11,(-$X$29+2))))","v":0},{"$f":"IF(AND($AZ$16=1,$Y$29=\"\"),11,IF($Y$29<0.1,-$Y$29,IF(AND($Y$29>-0.1,$Y$29<10),11,($Y$29+2))))","v":0},{"$f":"IF(AND($AY$16=1,$Y$29=\"\"),11,IF($Y$29>-0.1,$Y$29,IF(AND($Y$29<0.1,$Y$29>-10),11,(-$Y$29+2))))","v":0},{"$f":"IF($BB$16+$BC$16>2,IF($BB$16+$BC$16=3,$AV$49+$AX$49+$AZ$49,IF($BB$16+$BC$16=4,$AV$49+$AX$49+$AZ$49+$BB$49,IF($BB$16+$BC$16=5,$AV$49+$AX$49+$AZ$49+$BB$49+$BD$49,\"\"))),\"\")","v":""},{"$f":"IF($BB$16+$BC$16>2,IF($BB$16+$BC$16=3,$AW$49+$AY$49+$BA$49,IF($BB$16+$BC$16=4,$AW$49+$AY$49+$BA$49+$BC$49,IF($BB$16+$BC$16=5,$AW$49+$AY$49+$BA$49+$BC$49+$BE$49,\"\"))),\"\")","v":""}]
[{"$f":"IF(Prépa!$AE$44<>\"\",Prépa!$AE$44,\"\")","v":2},{"$f":"IF(Prépa!$AD$44<>\"\",Prépa!$AD$44,\"\")","v":"15h30"},{"$f":"IF($K$21<>\"\",$A$21,\"\")","v":6},"-",{"$f":"IF($K$22<>\"\",$A$22,\"\")","v":7},null,"SIREAU GOSSIAUX Florence",null,null,null,null,null,"-","DUBOIS Gilles",null,null,null,null,null,null,null,null,null,null,null,null,null,null,null,null,{"$f":"IF($AY37=1,0,IF($AZ37=1,2,IF($BB37<>\"\",IF($BB37=3,2,IF($BC37=3,1,\"\")),\"\")))","v":""},{"$f":"IF($AZ37=1,0,IF($AY37=1,2,IF($BC37<>\"\",IF($BC37=3,2,IF($BB37=3,1,\"\")),\"\")))","v":""}]
[{"$f":"IF(Prépa!$AE$48<>\"\",Prépa!$AE$48,\"\")","v":8},{"$f":"IF(Prépa!$AD$48<>\"\",Prépa!$AD$48,\"\")","v":"16h30"},{"$f":"IF($K$16<>\"\",$A$16,\"\")","v":1},"-",{"$f":"IF($K$17<>\"\",$A$17,\"\")","v":2},null,"PAPIRER Alan",null,null,null,null,null,"-","HENOUX Frédéric",null,null,null,null,null,"F",null,null,null,null,null,{"$f":"IF($AY38=1,0,IF($AZ38=1,2,IF($BB38<>\"\",IF($BB38=3,2,IF($BC38=3,1,\"\")),\"\")))","v":2},{"$f":"IF($AZ38=1,0,IF($AY38=1,2,IF($BC38<>\"\",IF($BC38=3,2,IF($BB38=3,1,\"\")),\"\")))","v":0},null,null,null,null,null,null,null,null,null,null,null,null,null,null,null,null,null,null,null,null,"Points"]
[{"$f":"IF(Prépa!$AE$49<>\"\",Prépa!$AE$49,\"\")","v":7},{"$f":"IF(Prépa!$AD$49<>\"\",Prépa!$AD$49,\"\")","v":"16h30"},{"$f":"IF($K$18<>\"\",$A$18,\"\")","v":3},"-",{"$f":"IF($K$23<>\"\",$A$23,\"\")","v":8},null,"ADJAL Yorick",null,null,null,null,null,"-","HASLE Stéphane",null,null,null,null,null,null,null,null,null,null,null,null,null,{"$f":"IF($AY39=1,0,IF($AZ39=1,2,IF($BB39<>\"\",IF($BB39=3,2,IF($BC39=3,1,\"\")),\"\")))","v":""},null,null,null,null,{"$f":"IF($AZ39=1,0,IF($AY39=1,2,IF($BC39<>\"\",IF($BC39=3,2,IF($BB39=3,1,\"\")),\"\")))","v":""},null,null,null,null,null,null,null,null,null,null,null,null,null,null,"Manche 6",null,"Manche 7",null,"J1","J2"]
[{"$f":"IF(Prépa!$AE$50<>\"\",Prépa!$AE$50,\"\")","v":6},{"$f":"IF(Prépa!$AD$50<>\"\",Prépa!$AD$50,\"\")","v":"16h30"},{"$f":"IF($K$19<>\"\",$A$19,\"\")","v":4},"-",{"$f":"IF($K$22<>\"\",$A$22,\"\")","v":7},null,"KERGOSIEN Arnaud",null,null,null,null,null,"-","DUBOIS Gilles",null,null,null,null,null,null,null,null,null,null,null,null,null,null,{"$f":"IF($AY40=1,0,IF($AZ40=1,2,IF($BB40<>\"\",IF($BB40=3,2,IF($BC40=3,1,\"\")),\"\")))","v":""},null,null,{"$f":"IF($AZ40=1,0,IF($AY40=1,2,IF($BC40<>\"\",IF($BC40=3,2,IF($BB40=3,1,\"\")),\"\")))","v":""},null,null,null,null,null,null,null,null,null,null,null,null,null,null,null,{"$f":"IF(AND($AZ$14=1,#REF!=\"\"),11,IF(#REF!<0.1,-#REF!,IF(AND(#REF!>-0.1,#REF!<10),11,(#REF!+2))))","v":{"$error":"#REF!"}},{"$f":"IF(AND($AY$14=1,#REF!=\"\"),11,IF(#REF!>-0.1,#REF!,IF(AND(#REF!<0.1,#REF!>-10),11,(-#REF!+2))))","v":{"$error":"#REF!"}},{"$f":"IF(AND($AZ$14=1,#REF!=\"\"),11,IF(#REF!<0.1,-#REF!,IF(AND(#REF!>-0.1,#REF!<10),11,(#REF!+2))))","v":{"$error":"#REF!"}},{"$f":"IF(AND($AY$14=1,#REF!=\"\"),11,IF(#REF!>-0.1,#REF!,IF(AND(#REF!<0.1,#REF!>-10),11,(-#REF!+2))))","v":{"$error":"#REF!"}},{"$f":"IF($BB$14+$BC$14>2,IF($BB$14+$BC$14=3,$AV$47+$AX$47+$AZ$47,IF($BB$14+$BC$14=4,$AV$47+$AX$47+$AZ$47+$BB$47,IF($BB$14+$BC$14=5,$AV$47+$AX$47+$AZ$47+$BB$47+$BD$47,IF($BB$14+$BC$14=6,$AV$47+$AX$47+$AZ$47+$BB$47+$BD$47+$AV$53,IF($BB$14+$BC$14=7,$AV$47+$AX$47+$AZ$47+$BB$47+$BD$47+$AV$53+$AX$53,\"\"))))),\"\")","v":""},{"$f":"IF($BB$14+$BC$14>2,IF($BB$14+$BC$14=3,$AW$47+$AY$47+$BA$47,IF($BB$14+$BC$14=4,$AW$47+$AY$47+$BA$47+$BC$47,IF($BB$14+$BC$14=5,$AW$47+$AY$47+$BA$47+$BC$47+$BE$47,IF($BB$14+$BC$14=6,$AW$47+$AY$47+$BA$47+$BC$47+$BE$47+$AW$53,IF($BB$14+$BC$14=7,$AW$47+$AY$47+$BA$47+$BC$47+$BE$47+$AW$53+$AY$53,\"\"))))),\"\")","v":""}]
[{"$f":"IF(Prépa!$AE$51<>\"\",Prépa!$AE$51,\"\")","v":5},{"$f":"IF(Prépa!$AD$51<>\"\",Prépa!$AD$51,\"\")","v":"16h30"},{"$f":"IF($K$20<>\"\",$A$20,\"\")","v":5},"-",{"$f":"IF($K$21<>\"\",$A$21,\"\")","v":6},null,"BELTRAND Arnaud",null,null,null,null,null,"-","SIREAU GOSSIAUX Florence",null,null,null,null,null,null,null,null,null,null,null,null,null,null,null,{"$f":"IF($AY41=1,0,IF($AZ41=1,2,IF($BB41<>\"\",IF($BB41=3,2,IF($BC41=3,1,\"\")),\"\")))","v":""},{"$f":"IF($AZ41=1,0,IF($AY41=1,2,IF($BC41<>\"\",IF($BC41=3,2,IF($BB41=3,1,\"\")),\"\")))","v":""},null,null,null,null,null,null,null,null,null,null,null,null,null,null,null,null,{"$f":"IF(AND($AZ$15=1,#REF!=\"\"),11,IF(#REF!<0.1,-#REF!,IF(AND(#REF!>-0.1,#REF!<10),11,(#REF!+2))))","v":{"$error":"#REF!"}},{"$f":"IF(AND($AY$15=1,#REF!=\"\"),11,IF(#REF!>-0.1,#REF!,IF(AND(#REF!<0.1,#REF!>-10),11,(-#REF!+2))))","v":{"$error":"#REF!"}},{"$f":"IF(AND($AZ$15=1,#REF!=\"\"),11,IF(#REF!<0.1,-#REF!,IF(AND(#REF!>-0.1,#REF!<10),11,(#REF!+2))))","v":{"$error":"#REF!"}},{"$f":"IF(AND($AY$15=1,#REF!=\"\"),11,IF(#REF!>-0.1,#REF!,IF(AND(#REF!<0.1,#REF!>-10),11,(-#REF!+2))))","v":{"$error":"#REF!"}},{"$f":"IF($BB$15+$BC$15>2,IF($BB$15+$BC$15=3,$AV$48+$AX$48+$AZ$48,IF($BB$15+$BC$15=4,$AV$48+$AX$48+$AZ$48+$BB$48,IF($BB$15+$BC$15=5,$AV$48+$AX$48+$AZ$48+$BB$48+$BD$48,IF($BB$15+$BC$15=6,$AV$48+$AX$48+$AZ$48+$BB$48+$BD$48+$AV$54,IF($BB$15+$BC$15=7,$AV$48+$AX$48+$AZ$48+$BB$48+$BD$48+$AV$54+$AX$54,\"\"))))),\"\")","v":0},{"$f":"IF($BB$15+$BC$15>2,IF($BB$15+$BC$15=3,$AW$48+$AY$48+$BA$48,IF($BB$15+$BC$15=4,$AW$48+$AY$48+$BA$48+$BC$48,IF($BB$15+$BC$15=5,$AW$48+$AY$48+$BA$48+$BC$48+$BE$48,IF($BB$15+$BC$15=6,$AW$48+$AY$48+$BA$48+$BC$48+$BE$48+$AW$54,IF($BB$15+$BC$15=7,$AW$48+$AY$48+$BA$48+$BC$48+$BE$48+$AW$54+$AY$54,\"\"))))),\"\")","v":33}]
["(1)  A = Abandon ou disqualification en cours de partie\n      F = Forfait, disqualification en dehors d’une partie ou refus de jouer",null,null,null,null,null,null,null,null,null,null,null,null,null,null,null,null,null,null,null,"Total points parties : ",null,null,null,null,{"$f":"IF(Z57>0,SUM(Z27:Z54),\"\")","v":2},{"$f":"IF(AA57>0,SUM(AA27:AA54),\"\")","v":0},2,2,2,2,2,{"$f":"IF(AG57>0,SUM(AG27:AG54),\"\")","v":2},null,null,null,null,null,null,null,null,null,null,null,null,null,null,{"$f":"IF(AND($AZ$16=1,#REF!=\"\"),11,IF(#REF!<0.1,-#REF!,IF(AND(#REF!>-0.1,#REF!<10),11,(#REF!+2))))","v":{"$error":"#REF!"}},{"$f":"IF(AND($AY$16=1,#REF!=\"\"),11,IF(#REF!>-0.1,#REF!,IF(AND(#REF!<0.1,#REF!>-10),11,(-#REF!+2))))","v":{"$error":"#REF!"}},{"$f":"IF(AND($AZ$16=1,#REF!=\"\"),11,IF(#REF!<0.1,-#REF!,IF(AND(#REF!>-0.1,#REF!<10),11,(#REF!+2))))","v":{"$error":"#REF!"}},{"$f":"IF(AND($AY$16=1,#REF!=\"\"),11,IF(#REF!>-0.1,#REF!,IF(AND(#REF!<0.1,#REF!>-10),11,(-#REF!+2))))","v":{"$error":"#REF!"}},{"$f":"IF($BB$16+$BC$16>2,IF($BB$16+$BC$16=3,$AV$49+$AX$49+$AZ$49,IF($BB$16+$BC$16=4,$AV$49+$AX$49+$AZ$49+$BB$49,IF($BB$16+$BC$16=5,$AV$49+$AX$49+$AZ$49+$BB$49+$BD$49,IF($BB$16+$BC$16=6,$AV$49+$AX$49+$AZ$49+$BB$49+$BD$49+$AV$55,IF($BB$16+$BC$16=7,$AV$49+$AX$49+$AZ$49+$BB$49+$BD$49+$AV$55+$AX$55,\"\"))))),\"\")","v":""},{"$f":"IF($BB$16+$BC$16>2,IF($BB$16+$BC$16=3,$AW$49+$AY$49+$BA$49,IF($BB$16+$BC$16=4,$AW$49+$AY$49+$BA$49+$BC$49,IF($BB$16+$BC$16=5,$AW$49+$AY$49+$BA$49+$BC$49+$BE$49,IF($BB$16+$BC$16=6,$AW$49+$AY$49+$BA$49+$BC$49+$BE$49+$AW$55,IF($BB$16+$BC$16=7,$AW$49+$AY$49+$BA$49+$BC$49+$BE$49+$AW$55+$AY$55,\"\"))))),\"\")","v":""}]
[null,null,null,null,null,null,null,null,null,null,null,null,null,null,null,null,null,null,null,null,"Classement : "]
[null,null,null,null,null,null,null,null,null,null,null,null,null,null,null,null,null,null,null,null,null,null,null,null,null,{"$f":"IF($K16<>\"\",1,0)","v":1},{"$f":"IF($K17<>\"\",1,0)","v":1},{"$f":"IF($K18<>\"\",1,0)","v":1},{"$f":"IF($K19<>\"\",1,0)","v":1},{"$f":"IF($K20<>\"\",1,0)","v":1},{"$f":"IF($K21<>\"\",1,0)","v":1},{"$f":"IF($K22<>\"\",1,0)","v":1},{"$f":"IF($K23<>\"\",1,0)","v":1}]
[null,"CLASSEMENT",null,null,null,null,null,null,null,null,null,null,null,null,null,null,null,null,null,null,null,null,null,null,{"$f":"COUNT($Z$56:$AG$56)","v":0},{"$f":"IF($K$16<>\"\",$K$16,\"\")","v":9},{"$f":"IF($K$17<>\"\",$K$17,\"\")","v":16},{"$f":"IF($K$18<>\"\",$K$18,\"\")","v":11},{"$f":"IF($K$19<>\"\",$K$19,\"\")","v":13},{"$f":"IF($K$20<>\"\",$K$20,\"\")","v":14},{"$f":"IF($K$21<>\"\",$K$21,\"\")","v":12},{"$f":"IF($K$22<>\"\",$K$22,\"\")","v":15},{"$f":"IF($K$23<>\"\",$K$23,\"\")","v":10}]
[null,"Rang","Dos.",null,"NOM Prénom",null,null,null,null,null,null,null,null,null,null,null,null,null,null,null,null,null,null,null,null,{"$f":"IF($Z$56<>\"\",$Z$55,\"\")","v":""},{"$f":"IF($AA$56<>\"\",$AA$55,\"\")","v":""},{"$f":"IF($AB$56<>\"\",$AB$55,\"\")","v":""},{"$f":"IF($AC$56<>\"\",$AC$55,\"\")","v":""},{"$f":"IF($AD$56<>\"\",$AD$55,\"\")","v":""},{"$f":"IF($AE$56<>\"\",$AE$55,\"\")","v":""},{"$f":"IF($AF$56<>\"\",$AF$55,\"\")","v":""},{"$f":"IF($AG$56<>\"\",$AG$55,\"\")","v":""}]
[null,"1er",{"$f":"IF(AND($Y$58>0,$Y$58=$K$24,$Z$56<>\"\"),HLOOKUP(1,$Z$56:$AG$59,3,FALSE),\"\")","v":""},null,{"$f":"IF($C$60<>\"\",VLOOKUP($C$60,Liste!$C$30:$I$37,3,FALSE),\"\")","v":""},null,null,null,null,null,null,null,null,{"$f":"IF($C$60<>\"\",HLOOKUP(1,$Z$56:$AG$59,4,FALSE)&\" pts\",\"\")","v":""},null,null,null,null,null,null,null,null,null,null,null,{"$f":"IF($BL$32<>\"\",$BL$32,IF($BL$25<>\"\",$BL$25,IF($BL$18<>\"\",$BL$18,\"\")))","v":""},null,null,{"$f":"IF($BN$32<>\"\",$BN$32,IF($BN$25<>\"\",$BN$25,IF($BN$18<>\"\",$BN$18,\"\")))","v":""},{"$f":"IF($BP$32<>\"\",$BP$32,IF($BP$25<>\"\",$BP$25,IF($BP$18<>\"\",$BP$18,\"\")))","v":""}]
[null,"2ème",{"$f":"IF(AND($Y$58>0,$Y$58=$K$24,$AA$56<>\"\"),HLOOKUP(2,$Z$56:$AG$59,3,FALSE),\"\")","v":""},null,{"$f":"IF($C$61<>\"\",VLOOKUP($C$61,Liste!$C$30:$I$37,3,FALSE),\"\")","v":""},null,null,null,null,null,null,null,null,{"$f":"IF($C$61<>\"\",HLOOKUP(2,$Z$56:$AG$60,4,FALSE)&\" pts\",\"\")","v":""}]
[null,"3ème",{"$f":"IF(AND($Y$58>0,$Y$58=$K$24,$AB$56<>\"\"),HLOOKUP(3,$Z$56:$AG$59,3,FALSE),\"\")","v":""},null,{"$f":"IF($C$62<>\"\",VLOOKUP($C$62,Liste!$C$30:$I$37,3,FALSE),\"\")","v":""},null,null,null,null,null,null,null,null,{"$f":"IF($C$62<>\"\",HLOOKUP(3,$Z$56:$AG$60,4,FALSE)&\" pts\",\"\")","v":""}]
[null,"4ème",{"$f":"IF(AND($Y$58>0,$Y$58=$K$24,$AC$56<>\"\"),HLOOKUP(4,$Z$56:$AG$59,3,FALSE),\"\")","v":""},null,{"$f":"IF($C$63<>\"\",VLOOKUP($C$63,Liste!$C$30:$I$37,3,FALSE),\"\")","v":""},null,null,null,null,null,null,null,null,{"$f":"IF($C$63<>\"\",HLOOKUP(4,$Z$56:$AG$60,4,FALSE)&\" pts\",\"\")","v":""}]
[null,"5ème",{"$f":"IF(AND($Y$58>0,$Y$58=$K$24,$AD$56<>\"\"),HLOOKUP(5,$Z$56:$AG$59,3,FALSE),\"\")","v":""},null,{"$f":"IF($C$64<>\"\",VLOOKUP($C$64,Liste!$C$30:$I$37,3,FALSE),\"\")","v":""},null,null,null,null,null,null,null,null,{"$f":"IF($C$64<>\"\",HLOOKUP(5,$Z$56:$AG$60,4,FALSE)&\" pts\",\"\")","v":""},null,null,null,null,null,"Nom et signature"]
[null,"6ème",{"$f":"IF(AND($Y$58>0,$Y$58=$K$24,$AD$56<>\"\"),HLOOKUP(6,$Z$56:$AG$59,3,FALSE),\"\")","v":""},null,{"$f":"IF($C$65<>\"\",VLOOKUP($C$65,Liste!$C$30:$I$37,3,FALSE),\"\")","v":""},null,null,null,null,null,null,null,null,{"$f":"IF($C$65<>\"\",HLOOKUP(6,$Z$56:$AG$60,4,FALSE)&\" pts\",\"\")","v":""},null,null,null,null,null,"du juge arbitre"]
[null,"7ème",{"$f":"IF(AND($Y$58>0,$Y$58=$K$24,$AF$56<>\"\"),HLOOKUP(7,$Z$56:$AG$59,3,FALSE),\"\")","v":""},null,{"$f":"IF($C$66<>\"\",VLOOKUP($C$66,Liste!$C$30:$I$37,3,FALSE),\"\")","v":""},null,null,null,null,null,null,null,null,{"$f":"IF($C$66<>\"\",HLOOKUP(7,$Z$56:$AG$60,4,FALSE)&\" pts\",\"\")","v":""},null,null,null,null,null,{"$f":"IF(Prépa!$E$33<>\"\",Prépa!$E$33,\"\")","v":"Nico Angenon"}]
[null,"3ème",{"$f":"IF(AND($Y$58>0,$Y$58=$K$24,$AG$56<>\"\"),HLOOKUP(8,$Z$56:$AG$59,3,FALSE),\"\")","v":""},null,{"$f":"IF($C$67<>\"\",VLOOKUP($C$67,Liste!$C$30:$I$37,3,FALSE),\"\")","v":""},null,null,null,null,null,null,null,null,{"$f":"IF($C$67<>\"\",HLOOKUP(8,$Z$56:$AG$60,4,FALSE)&\" pts\",\"\")","v":""}]

{"sheet":"Classement","index":6,"n_rows":61,"n_cols":11,"rows_kept":61,"cut":false,"hidden":false,"merged":[[5,1,8,6],[3,1,4,6],[60,4,60,5],[10,1,11,6],[18,10,19,15],[21,10,22,15],[45,1,45,6],[53,1,53,6],[13,1,15,6],[29,1,31,6]]}
[null,null,null,{"$f":"\"  \"&Prépa!$C$1","v":"  FEDERATION FRANCAISE"},null,null,{"$f":"IF(Prépa!$O$92<>0,\"Saison \"&Prépa!$O$92,\"\")","v":"Saison 2017 - 2018"}]
[null,null,null,{"$f":"\"  \"&Prépa!$C$2","v":"  HANDISPORT"},null,null,{"$f":"IF(Prépa!$O$79<>0,Prépa!$O$79,\"\")","v":"2ème Tour"}]
[]
[null,{"$f":"IF(Prépa!$D$14<>0,Prépa!$D$14,\"\")&IF(Prépa!$K$110<>0,\" - \"&Prépa!$K$110,\"\")","v":"TOURS - 10 Fevrier 2018"}]
[]
[null,{"$f":"IF(Prépa!$O$10<>0,Prépa!$O$10,\"\")","v":"Critérium Fédéral"}]
[]
[]
[]
[]
[null,{"$f":"IF(AND(Prépa!$O$72<>\"\",Prépa!$O$50<>0),Prépa!$O$72&\" - Région \"&Prépa!$O$50,IF(Prépa!$O$72<>\"\",Prépa!$O$72,\"\"))","v":"OPEN Assis - Région Bourgogne - Franche-Comté"}]
[]
[]
[null,{"$f":"IF(Prépa!$O$29<>\"\",\" Résultats \"&Prépa!$O$29,\"\")","v":" Résultats Nat 2A Nord"}]
[]
[]
[]
[null,null,"Dos.","Noms - Prénoms","Clubs","Classe","Zone"]
[null,null,null,null,null,null,null,null,null,null,"IMPRIMER"]
[null,1,{"$f":"IF('GROUPE A'!$C$60<>\"\",'GROUPE A'!$C$60,\"\")","v":""},{"$f":"IF(C20<>\"\",VLOOKUP(C20,Liste!$C$17:$I$24,3,FALSE),\"\")","v":""},{"$f":"IF(C20<>\"\",VLOOKUP(C20,Liste!$C$17:$I$24,7,FALSE),\"\")","v":""},{"$f":"IF(C20<>\"\",VLOOKUP(C20,Liste!$C$17:$I$24,4,FALSE),\"\")","v":""},{"$f":"IF(C20<>\"\",VLOOKUP(C20,Liste!$C$17:$I$24,5,FALSE),\"\")","v":""}]
[null,2,{"$f":"IF('GROUPE A'!$C$61<>\"\",'GROUPE A'!$C$61,\"\")","v":""},{"$f":"IF(C21<>\"\",VLOOKUP(C21,Liste!$C$17:$I$24,3,FALSE),\"\")","v":""},{"$f":"IF(C21<>\"\",VLOOKUP(C21,Liste!$C$17:$I$24,7,FALSE),\"\")","v":""},{"$f":"IF(C21<>\"\",VLOOKUP(C21,Liste!$C$17:$I$24,4,FALSE),\"\")","v":""},{"$f":"IF(C21<>\"\",VLOOKUP(C21,Liste!$C$17:$I$24,5,FALSE),\"\")","v":""}]
[null,3,{"$f":"IF('GROUPE A'!$C$62<>\"\",'GROUPE A'!$C$62,\"\")","v":""},{"$f":"IF(C22<>\"\",VLOOKUP(C22,Liste!$C$17:$I$24,3,FALSE),\"\")","v":""},{"$f":"IF(C22<>\"\",VLOOKUP(C22,Liste!$C$17:$I$24,7,FALSE),\"\")","v":""},{"$f":"IF(C22<>\"\",VLOOKUP(C22,Liste!$C$17:$I$24,4,FALSE),\"\")","v":""},{"$f":"IF(C22<>\"\",VLOOKUP(C22,Liste!$C$17:$I$24,5,FALSE),\"\")","v":""},null,null,null,"Classement C"]
[null,4,{"$f":"IF('GROUPE A'!$C$63<>\"\",'GROUPE A'!$C$63,\"\")","v":""},{"$f":"IF(C23<>\"\",VLOOKUP(C23,Liste!$C$17:$I$24,3,FALSE),\"\")","v":""},{"$f":"IF(C23<>\"\",VLOOKUP(C23,Liste!$C$17:$I$24,7,FALSE),\"\")","v":""},{"$f":"IF(C23<>\"\",VLOOKUP(C23,Liste!$C$17:$I$24,4,FALSE),\"\")","v":""},{"$f":"IF(C23<>\"\",VLOOKUP(C23,Liste!$C$17:$I$24,5,FALSE),\"\")","v":""}]
[null,5,{"$f":"IF('GROUPE A'!$C$64<>\"\",'GROUPE A'!$C$64,\"\")","v":""},{"$f":"IF(C24<>\"\",VLOOKUP(C24,Liste!$C$17:$I$24,3,FALSE),\"\")","v":""},{"$f":"IF(C24<>\"\",VLOOKUP(C24,Liste!$C$17:$I$24,7,FALSE),\"\")","v":""},{"$f":"IF(C24<>\"\",VLOOKUP(C24,Liste!$C$17:$I$24,4,FALSE),\"\")","v":""},{"$f":"IF(C24<>\"\",VLOOKUP(C24,Liste!$C$17:$I$24,5,FALSE),\"\")","v":""}]
[null,6,{"$f":"IF('GROUPE A'!$C$65<>\"\",'GROUPE A'!$C$65,\"\")","v":""},{"$f":"IF(C25<>\"\",VLOOKUP(C25,Liste!$C$17:$I$24,3,FALSE),\"\")","v":""},{"$f":"IF(C25<>\"\",VLOOKUP(C25,Liste!$C$17:$I$24,7,FALSE),\"\")","v":""},{"$f":"IF(C25<>\"\",VLOOKUP(C25,Liste!$C$17:$I$24,4,FALSE),\"\")","v":""},{"$f":"IF(C25<>\"\",VLOOKUP(C25,Liste!$C$17:$I$24,5,FALSE),\"\")","v":""}]
[null,7,{"$f":"IF('GROUPE A'!$C$66<>\"\",'GROUPE A'!$C$66,\"\")","v":""},{"$f":"IF(C26<>\"\",VLOOKUP(C26,Liste!$C$17:$I$24,3,FALSE),\"\")","v":""},{"$f":"IF(C26<>\"\",VLOOKUP(C26,Liste!$C$17:$I$24,7,FALSE),\"\")","v":""},{"$f":"IF(C26<>\"\",VLOOKUP(C26,Liste!$C$17:$I$24,4,FALSE),\"\")","v":""},{"$f":"IF(C26<>\"\",VLOOKUP(C26,Liste!$C$17:$I$24,5,FALSE),\"\")","v":""}]
[null,8,{"$f":"IF('GROUPE A'!$C$67<>\"\",'GROUPE A'!$C$67,\"\")","v":""},{"$f":"IF(C27<>\"\",VLOOKUP(C27,Liste!$C$17:$I$24,3,FALSE),\"\")","v":""},{"$f":"IF(C27<>\"\",VLOOKUP(C27,Liste!$C$17:$I$24,7,FALSE),\"\")","v":""},{"$f":"IF(C27<>\"\",VLOOKUP(C27,Liste!$C$17:$I$24,4,FALSE),\"\")","v":""},{"$f":"IF(C27<>\"\",VLOOKUP(C27,Liste!$C$17:$I$24,5,FALSE),\"\")","v":""}]
[]
[]
[null,{"$f":"IF(Prépa!$O$32<>\"\",\" Résultats \"&Prépa!$O$32,\"\")","v":" Résultats Nat 2B Nord"}]
[]
[]
[]
[null,null,"Dos.","Noms - Prénoms","Clubs","Classe","Zone"]
[]
[null,1,{"$f":"IF('GROUPE B'!$C$60<>\"\",'GROUPE B'!$C$60,\"\")","v":""},{"$f":"IF(C36<>\"\",VLOOKUP(C36,Liste!$C$30:$I$37,3,FALSE),\"\")","v":""},{"$f":"IF(C36<>\"\",VLOOKUP(C36,Liste!$C$30:$I$37,7,FALSE),\"\")","v":""},{"$f":"IF(C36<>\"\",VLOOKUP(C36,Liste!$C$30:$I$37,4,FALSE),\"\")","v":""},{"$f":"IF(C36<>\"\",VLOOKUP(C36,Liste!$C$30:$I$37,5,FALSE),\"\")","v":""}]
[null,2,{"$f":"IF('GROUPE B'!$C$61<>\"\",'GROUPE B'!$C$61,\"\")","v":""},{"$f":"IF(C37<>\"\",VLOOKUP(C37,Liste!$C$30:$I$37,3,FALSE),\"\")","v":""},{"$f":"IF(C37<>\"\",VLOOKUP(C37,Liste!$C$30:$I$37,7,FALSE),\"\")","v":""},{"$f":"IF(C37<>\"\",VLOOKUP(C37,Liste!$C$30:$I$37,4,FALSE),\"\")","v":""},{"$f":"IF(C37<>\"\",VLOOKUP(C37,Liste!$C$30:$I$37,5,FALSE),\"\")","v":""}]
[null,3,{"$f":"IF('GROUPE B'!$C$62<>\"\",'GROUPE B'!$C$62,\"\")","v":""},{"$f":"IF(C38<>\"\",VLOOKUP(C38,Liste!$C$30:$I$37,3,FALSE),\"\")","v":""},{"$f":"IF(C38<>\"\",VLOOKUP(C38,Liste!$C$30:$I$37,7,FALSE),\"\")","v":""},{"$f":"IF(C38<>\"\",VLOOKUP(C38,Liste!$C$30:$I$37,4,FALSE),\"\")","v":""},{"$f":"IF(C38<>\"\",VLOOKUP(C38,Liste!$C$30:$I$37,5,FALSE),\"\")","v":""}]
[null,4,{"$f":"IF('GROUPE B'!$C$63<>\"\",'GROUPE B'!$C$63,\"\")","v":""},{"$f":"IF(C39<>\"\",VLOOKUP(C39,Liste!$C$30:$I$37,3,FALSE),\"\")","v":""},{"$f":"IF(C39<>\"\",VLOOKUP(C39,Liste!$C$30:$I$37,7,FALSE),\"\")","v":""},{"$f":"IF(C39<>\"\",VLOOKUP(C39,Liste!$C$30:$I$37,4,FALSE),\"\")","v":""},{"$f":"IF(C39<>\"\",VLOOKUP(C39,Liste!$C$30:$I$37,5,FALSE),\"\")","v":""}]
[null,5,{"$f":"IF('GROUPE B'!$C$64<>\"\",'GROUPE B'!$C$64,\"\")","v":""},{"$f":"IF(C40<>\"\",VLOOKUP(C40,Liste!$C$30:$I$37,3,FALSE),\"\")","v":""},{"$f":"IF(C40<>\"\",VLOOKUP(C40,Liste!$C$30:$I$37,7,FALSE),\"\")","v":""},{"$f":"IF(C40<>\"\",VLOOKUP(C40,Liste!$C$30:$I$37,4,FALSE),\"\")","v":""},{"$f":"IF(C40<>\"\",VLOOKUP(C40,Liste!$C$30:$I$37,5,FALSE),\"\")","v":""}]
[null,6,{"$f":"IF('GROUPE B'!$C$65<>\"\",'GROUPE B'!$C$65,\"\")","v":""},{"$f":"IF(C41<>\"\",VLOOKUP(C41,Liste!$C$30:$I$37,3,FALSE),\"\")","v":""},{"$f":"IF(C41<>\"\",VLOOKUP(C41,Liste!$C$30:$I$37,7,FALSE),\"\")","v":""},{"$f":"IF(C41<>\"\",VLOOKUP(C41,Liste!$C$30:$I$37,4,FALSE),\"\")","v":""},{"$f":"IF(C41<>\"\",VLOOKUP(C41,Liste!$C$30:$I$37,5,FALSE),\"\")","v":""}]
[null,7,{"$f":"IF('GROUPE B'!$C$66<>\"\",'GROUPE B'!$C$66,\"\")","v":""},{"$f":"IF(C42<>\"\",VLOOKUP(C42,Liste!$C$30:$I$37,3,FALSE),\"\")","v":""},{"$f":"IF(C42<>\"\",VLOOKUP(C42,Liste!$C$30:$I$37,7,FALSE),\"\")","v":""},{"$f":"IF(C42<>\"\",VLOOKUP(C42,Liste!$C$30:$I$37,4,FALSE),\"\")","v":""},{"$f":"IF(C42<>\"\",VLOOKUP(C42,Liste!$C$30:$I$37,5,FALSE),\"\")","v":""}]
[null,8,{"$f":"IF('GROUPE B'!$C$67<>\"\",'GROUPE B'!$C$67,\"\")","v":""},{"$f":"IF(C43<>\"\",VLOOKUP(C43,Liste!$C$30:$I$37,3,FALSE),\"\")","v":""},{"$f":"IF(C43<>\"\",VLOOKUP(C43,Liste!$C$30:$I$37,7,FALSE),\"\")","v":""},{"$f":"IF(C43<>\"\",VLOOKUP(C43,Liste!$C$30:$I$37,4,FALSE),\"\")","v":""},{"$f":"IF(C43<>\"\",VLOOKUP(C43,Liste!$C$30:$I$37,5,FALSE),\"\")","v":""}]
[]
[]
[null,"Forfaits excusés"]
[]
[null,1,null,{"$f":"IF(C48<>\"\",VLOOKUP(C48,Liste!$C$17:$I$37,3,FALSE),\"\")","v":""},{"$f":"IF(C48<>\"\",VLOOKUP(C48,Liste!$C$17:$I$37,7,FALSE),\"\")","v":""},{"$f":"IF(C48<>\"\",VLOOKUP(C48,Liste!$C$17:$I$37,4,FALSE),\"\")","v":""},{"$f":"IF(C48<>\"\",VLOOKUP(C48,Liste!$C$17:$I$37,5,FALSE),\"\")","v":""}]
[null,2,null,{"$f":"IF(C49<>\"\",VLOOKUP(C49,Liste!$C$17:$I$37,3,FALSE),\"\")","v":""},{"$f":"IF(C49<>\"\",VLOOKUP(C49,Liste!$C$17:$I$37,7,FALSE),\"\")","v":""},{"$f":"IF(C49<>\"\",VLOOKUP(C49,Liste!$C$17:$I$37,4,FALSE),\"\")","v":""},{"$f":"IF(C49<>\"\",VLOOKUP(C49,Liste!$C$17:$I$37,5,FALSE),\"\")","v":""}]
[null,3,null,{"$f":"IF(C50<>\"\",VLOOKUP(C50,Liste!$C$17:$I$37,3,FALSE),\"\")","v":""},{"$f":"IF(C50<>\"\",VLOOKUP(C50,Liste!$C$17:$I$37,7,FALSE),\"\")","v":""},{"$f":"IF(C50<>\"\",VLOOKUP(C50,Liste!$C$17:$I$37,4,FALSE),\"\")","v":""},{"$f":"IF(C50<>\"\",VLOOKUP(C50,Liste!$C$17:$I$37,5,FALSE),\"\")","v":""}]
[null,4,null,{"$f":"IF(C51<>\"\",VLOOKUP(C51,Liste!$C$17:$I$37,3,FALSE),\"\")","v":""},{"$f":"IF(C51<>\"\",VLOOKUP(C51,Liste!$C$17:$I$37,7,FALSE),\"\")","v":""},{"$f":"IF(C51<>\"\",VLOOKUP(C51,Liste!$C$17:$I$37,4,FALSE),\"\")","v":""},{"$f":"IF(C51<>\"\",VLOOKUP(C51,Liste!$C$17:$I$37,5,FALSE),\"\")","v":""}]
[null,5,null,{"$f":"IF(C52<>\"\",VLOOKUP(C52,Liste!$C$17:$I$37,3,FALSE),\"\")","v":""},{"$f":"IF(C52<>\"\",VLOOKUP(C52,Liste!$C$17:$I$37,7,FALSE),\"\")","v":""},{"$f":"IF(C52<>\"\",VLOOKUP(C52,Liste!$C$17:$I$37,4,FALSE),\"\")","v":""},{"$f":"IF(C52<>\"\",VLOOKUP(C52,Liste!$C$17:$I$37,5,FALSE),\"\")","v":""}]
[]
[null,"Forfaits non excusés"]
[null,1,null,{"$f":"IF(C55<>\"\",VLOOKUP(C55,Liste!$C$17:$I$37,3,FALSE),\"\")","v":""},{"$f":"IF(C55<>\"\",VLOOKUP(C55,Liste!$C$17:$I$37,7,FALSE),\"\")","v":""},{"$f":"IF(C55<>\"\",VLOOKUP(C55,Liste!$C$17:$I$37,4,FALSE),\"\")","v":""},{"$f":"IF(C55<>\"\",VLOOKUP(C55,Liste!$C$17:$I$37,5,FALSE),\"\")","v":""}]
[null,2,null,{"$f":"IF(C56<>\"\",VLOOKUP(C56,Liste!$C$17:$I$37,3,FALSE),\"\")","v":""},{"$f":"IF(C56<>\"\",VLOOKUP(C56,Liste!$C$17:$I$37,7,FALSE),\"\")","v":""},{"$f":"IF(C56<>\"\",VLOOKUP(C56,Liste!$C$17:$I$37,4,FALSE),\"\")","v":""},{"$f":"IF(C56<>\"\",VLOOKUP(C56,Liste!$C$17:$I$37,5,FALSE),\"\")","v":""}]
[null,3,null,{"$f":"IF(C57<>\"\",VLOOKUP(C57,Liste!$C$17:$I$37,3,FALSE),\"\")","v":""},{"$f":"IF(C57<>\"\",VLOOKUP(C57,Liste!$C$17:$I$37,7,FALSE),\"\")","v":""},{"$f":"IF(C57<>\"\",VLOOKUP(C57,Liste!$C$17:$I$37,4,FALSE),\"\")","v":""},{"$f":"IF(C57<>\"\",VLOOKUP(C57,Liste!$C$17:$I$37,5,FALSE),\"\")","v":""}]
[null,4,null,{"$f":"IF(C58<>\"\",VLOOKUP(C58,Liste!$C$17:$I$37,3,FALSE),\"\")","v":""},{"$f":"IF(C58<>\"\",VLOOKUP(C58,Liste!$C$17:$I$37,7,FALSE),\"\")","v":""},{"$f":"IF(C58<>\"\",VLOOKUP(C58,Liste!$C$17:$I$37,4,FALSE),\"\")","v":""},{"$f":"IF(C58<>\"\",VLOOKUP(C58,Liste!$C$17:$I$37,5,FALSE),\"\")","v":""}]
[null,5,null,{"$f":"IF(C59<>\"\",VLOOKUP(C59,Liste!$C$17:$I$37,3,FALSE),\"\")","v":""},{"$f":"IF(C59<>\"\",VLOOKUP(C59,Liste!$C$17:$I$37,7,FALSE),\"\")","v":""},{"$f":"IF(C59<>\"\",VLOOKUP(C59,Liste!$C$17:$I$37,4,FALSE),\"\")","v":""},{"$f":"IF(C59<>\"\",VLOOKUP(C59,Liste!$C$17:$I$37,5,FALSE),\"\")","v":""}]
[]
[null,null,null,"Le Juge-Arbitre :",{"$f":"IF(Prépa!$E$33<>\"\",Prépa!$E$33,\"\")","v":"Nico Angenon"}]

{"sheet":"F_Parties","index":7,"n_rows":461,"n_cols":46,"rows_kept":461,"cut":false,"hidden":false,"merged":[[124,36,125,38],[124,39,125,39],[124,25,125,27],[124,28,125,28],[124,29,125,29],[124,30,125,30],[126,36,127,38],[126,39,127,39],[126,40,127,40],[126,41,127,41],[126,17,127,17],[126,18,127,18],[117,39,119,39],[117,40,119,40],[117,41,119,41],[119,36,119,38],[117,42,119,42],[117,43,119,43],[117,44,119,44],[117,45,119,45],[126,25,127,27],[126,28,127,28],[126,29,127,29],[126,30,127,30],[123,2,123,4],[123,13,123,15],[123,25,123,27],[123,36,123,38],[124,2,125,4],[124,5,125,5],[124,6,125,6],[124,7,125,7],[124,13,125,15],[124,16,125,16],[124,40,125,40],[124,41,125,41],[126,2,127,4],[126,5,127,5],[126,6,127,6],[126,7,127,7],[126,13,127,15],[126,16,127,16],[124,17,125,17],[124,18,125,18],[118,2,118,4],[118,13,118,15],[118,25,118,27],[118,36,118,38],[119,2,119,4],[119,13,119,15],[117,5,119,5],[117,6,119,6],[117,7,119,7],[117,8,119,8],[117,9,119,9],[117,10,119,10],[117,11,119,11],[117,16,119,16],[117,17,119,17],[117,18,119,18],[117,19,119,19],[117,20,119,20],[117,21,119,21],[117,22,119,22],[117,28,119,28],[117,29,119,29],[117,30,119,30],[117,31,119,31],[119,25,119,27],[117,32,119,32],[117,33,119,33],[117,34,119,34],[112,30,114,30],[112,31,114,31],[114,25,114,27],[112,32,114,32],[112,33,114,33],[112,34,114,34],[112,39,114,39],[112,40,114,40],[112,41,114,41],[114,36,114,38],[112,42,114,42],[112,43,114,43],[112,44,114,44],[112,45,114,45],[113,2,113,4],[113,13,113,15],[113,25,113,27],[113,36,113,38],[114,2,114,4],[114,13,114,15],[108,6,108,10],[108,17,108,21],[108,29,108,33],[108,40,108,44],[109,5,109,11],[109,16,109,22],[109,28,109,34],[109,39,109,45],[110,2,110,4],[110,13,110,15],[110,25,110,27],[110,36,110,38],[111,5,111,11],[111,16,111,22],[111,28,111,34],[111,39,111,45],[112,5,114,5],[112,6,114,6],[112,7,114,7],[112,8,114,8],[112,9,114,9],[112,10,114,10],[112,11,114,11],[112,16,114,16],[112,17,114,17],[112,18,114,18],[112,19,114,19],[112,20,114,20],[112,21,114,21],[112,22,114,22],[112,28,114,28],[112,29,114,29],[93,40,94,40],[93,41,94,41],[100,2,100,11],[100,13,100,22],[100,25,100,34],[100,36,100,45],[93,17,94,17],[93,18,94,18],[101,2,101,11],[101,13,101,22],[101,25,101,34],[101,36,101,45],[103,2,103,11],[103,13,103,22],[103,25,103,34],[103,36,103,45],[105,5,105,6],[105,16,105,17],[105,28,105,29],[105,39,105,40],[90,2,90,4],[90,13,90,15],[90,25,90,27],[90,36,90,38],[91,2,92,4],[91,5,92,5],[91,6,92,6],[91,7,92,7],[91,13,92,15],[91,16,92,16],[91,40,92,40],[91,41,92,41],[93,2,94,4],[93,5,94,5],[93,6,94,6],[93,7,94,7],[93,13,94,15],[93,16,94,16],[91,17,92,17],[91,18,92,18],[93,25,94,27],[93,28,94,28],[93,29,94,29],[93,30,94,30],[91,36,92,38],[91,39,92,39],[91,25,92,27],[91,28,92,28],[91,29,92,29],[91,30,92,30],[93,36,94,38],[93,39,94,39],[84,45,86,45],[85,2,85,4],[85,13,85,15],[85,25,85,27],[85,36,85,38],[86,2,86,4],[86,13,86,15],[84,5,86,5],[84,6,86,6],[84,7,86,7],[84,8,86,8],[84,9,86,9],[84,10,86,10],[84,11,86,11],[84,16,86,16],[84,17,86,17],[84,18,86,18],[84,19,86,19],[84,20,86,20],[84,21,86,21],[84,22,86,22],[84,28,86,28],[84,29,86,29],[84,30,86,30],[79,30,81,30],[79,31,81,31],[81,25,81,27],[79,32,81,32],[79,33,81,33],[79,34,81,34],[79,39,81,39],[79,40,81,40],[79,41,81,41],[81,36,81,38],[79,42,81,42],[79,43,81,43],[79,44,81,44],[84,31,86,31],[86,25,86,27],[84,32,86,32],[84,33,86,33],[84,34,86,34],[84,39,86,39],[84,40,86,40],[84,41,86,41],[86,36,86,38],[84,42,86,42],[84,43,86,43],[84,44,86,44],[79,28,81,28],[79,29,81,29],[81,2,81,4],[81,13,81,15],[75,6,75,10],[75,17,75,21],[75,29,75,33],[75,40,75,44],[76,5,76,11],[76,16,76,22],[76,28,76,34],[76,39,76,45],[77,2,77,4],[77,13,77,15],[77,25,77,27],[77,36,77,38],[78,5,78,11],[78,16,78,22],[78,28,78,34],[78,39,78,45],[79,5,81,5],[79,6,81,6],[79,7,81,7],[79,8,81,8],[79,9,81,9],[79,10,81,10],[79,11,81,11],[79,16,81,16],[79,17,81,17],[79,18,81,18],[79,19,81,19],[79,20,81,20],[79,21,81,21],[79,22,81,22],[67,2,67,11],[67,13,67,22],[67,25,67,34],[67,36,67,45],[60,17,61,17],[60,18,61,18],[68,2,68,11],[68,13,68,22],[68,25,68,34],[68,36,68,45],[70,2,70,11],[70,13,70,22],[70,25,70,34],[70,36,70,45],[72,5,72,6],[72,16,72,17],[72,28,72,29],[72,39,72,40],[79,45,81,45],[80,2,80,4],[80,13,80,15],[80,25,80,27],[80,36,80,38],[57,2,57,4],[57,13,57,15],[57,25,57,27],[57,36,57,38],[58,2,59,4],[58,5,59,5],[58,6,59,6],[58,7,59,7],[58,13,59,15],[58,16,59,16],[58,40,59,40],[58,41,59,41],[60,2,61,4],[60,5,61,5],[60,6,61,6],[60,7,61,7],[60,13,61,15],[60,16,61,16],[58,17,59,17],[58,18,59,18],[60,25,61,27],[60,28,61,28],[60,29,61,29],[60,30,61,30],[58,36,59,38],[58,39,59,39],[58,25,59,27],[58,28,59,28],[58,29,59,29],[58,30,59,30],[60,36,61,38],[60,39,61,39],[51,45,53,45],[52,2,52,4],[52,13,52,15],[52,25,52,27],[52,36,52,38],[53,2,53,4],[53,13,53,15],[51,5,53,5],[51,6,53,6],[51,7,53,7],[51,8,53,8],[51,9,53,9],[51,10,53,10],[51,11,53,11],[51,16,53,16],[51,17,53,17],[51,18,53,18],[51,19,53,19],[51,20,53,20],[51,21,53,21],[51,22,53,22],[51,28,53,28],[51,29,53,29],[51,30,53,30],[60,40,61,40],[60,41,61,41],[46,30,48,30],[46,31,48,31],[48,25,48,27],[46,32,48,32],[46,33,48,33],[46,34,48,34],[46,39,48,39],[46,40,48,40],[46,41,48,41],[48,36,48,38],[46,42,48,42],[46,43,48,43],[46,44,48,44],[51,31,53,31],[53,25,53,27],[51,32,53,32],[51,33,53,33],[51,34,53,34],[51,39,53,39],[51,40,53,40],[51,41,53,41],[53,36,53,38],[51,42,53,42],[51,43,53,43],[51,44,53,44],[46,28,48,28],[46,29,48,29],[48,2,48,4],[48,13,48,15],[42,6,42,10],[42,17,42,21],[42,29,42,33],[42,40,42,44],[43,5,43,11],[43,16,43,22],[43,28,43,34],[43,39,43,45],[44,2,44,4],[44,13,44,15],[44,25,44,27],[44,36,44,38],[45,5,45,11],[45,16,45,22],[45,28,45,34],[45,39,45,45],[46,5,48,5],[46,6,48,6],[46,7,48,7],[46,8,48,8],[46,9,48,9],[46,10,48,10],[46,11,48,11],[46,16,48,16],[46,17,48,17],[46,18,48,18],[46,19,48,19],[46,20,48,20],[46,21,48,21],[46,22,48,22],[34,2,34,11],[34,13,34,22],[34,25,34,34],[34,36,34,45],[27,17,28,17],[27,18,28,18],[35,2,35,11],[35,13,35,22],[35,25,35,34],[35,36,35,45],[37,2,37,11],[37,13,37,22],[37,25,37,34],[37,36,37,45],[39,5,39,6],[39,16,39,17],[39,28,39,29],[39,39,39,40],[46,45,48,45],[47,2,47,4],[47,13,47,15],[47,25,47,27],[47,36,47,38],[24,2,24,4],[24,13,24,15],[24,25,24,27],[24,36,24,38],[25,2,26,4],[25,5,26,5],[25,6,26,6],[25,7,26,7],[25,13,26,15],[25,16,26,16],[25,40,26,40],[25,41,26,41],[27,2,28,4],[27,5,28,5],[27,6,28,6],[27,7,28,7],[27,13,28,15],[27,16,28,16],[25,17,26,17],[25,18,26,18],[27,25,28,27],[27,28,28,28],[27,29,28,29],[27,30,28,30],[25,36,26,38],[25,39,26,39],[25,25,26,27],[25,28,26,28],[25,29,26,29],[25,30,26,30],[27,36,28,38],[27,39,28,39],[18,30,20,30],[18,31,20,31],[20,25,20,27],[18,32,20,32],[18,33,20,33],[18,34,20,34],[18,39,20,39],[18,40,20,40],[18,41,20,41],[20,36,20,38],[18,42,20,42],[18,43,20,43],[27,40,28,40],[27,41,28,41],[18,44,20,44],[18,45,20,45],[19,2,19,4],[19,13,19,15],[19,25,19,27],[19,36,19,38],[20,2,20,4],[20,13,20,15],[13,44,15,44],[13,29,15,29],[13,30,15,30],[13,31,15,31],[13,32,15,32],[13,33,15,33],[13,45,15,45],[14,2,14,4],[14,13,14,15],[14,25,14,27],[14,36,14,38],[15,2,15,4],[15,13,15,15],[15,25,15,27],[15,36,15,38],[13,39,15,39],[18,5,20,5],[18,6,20,6],[18,7,20,7],[18,8,20,8],[18,9,20,9],[18,10,20,10],[18,11,20,11],[18,16,20,16],[18,17,20,17],[18,18,20,18],[18,19,20,19],[18,20,20,20],[18,21,20,21],[18,22,20,22],[18,28,20,28],[18,29,20,29],[10,5,10,11],[10,16,10,22],[10,28,10,34],[10,39,10,45],[11,2,11,4],[11,13,11,15],[11,25,11,27],[11,36,11,38],[12,5,12,11],[12,16,12,22],[12,28,12,34],[12,39,12,45],[13,5,15,5],[13,6,15,6],[13,7,15,7],[13,8,15,8],[13,9,15,9],[13,10,15,10],[13,11,15,11],[13,16,15,16],[13,17,15,17],[13,34,15,34],[13,18,15,18],[13,19,15,19],[13,20,15,20],[13,21,15,21],[13,22,15,22],[13,28,15,28],[13,40,15,40],[13,41,15,41],[13,42,15,42],[13,43,15,43],[1,2,1,11],[1,13,1,22],[1,25,1,34],[1,36,1,45],[2,2,2,11],[2,13,2,22],[2,25,2,34],[2,36,2,45],[4,2,4,11],[4,13,4,22],[4,25,4,34],[4,36,4,45],[6,5,6,6],[6,16,6,17],[6,28,6,29],[6,39,6,40],[9,6,9,10],[9,17,9,21],[9,29,9,33],[9,40,9,44],[454,39,455,39],[454,40,455,40],[454,41,455,41],[456,2,457,4],[456,5,457,5],[456,6,457,6],[456,7,457,7],[456,13,457,15],[456,16,457,16],[456,17,457,17],[456,18,457,18],[456,25,457,27],[456,28,457,28],[456,29,457,29],[456,30,457,30],[456,36,457,38],[456,39,457,39],[456,40,457,40],[456,41,457,41],[453,2,453,4],[453,13,453,15],[453,25,453,27],[453,36,453,38],[454,2,455,4],[454,5,455,5],[454,6,455,6],[454,7,455,7],[454,13,455,15],[454,16,455,16],[454,17,455,17],[454,18,455,18],[454,25,455,27],[454,28,455,28],[454,29,455,29],[454,30,455,30],[454,36,455,38],[447,31,449,31],[447,42,449,42],[447,43,449,43],[447,44,449,44],[447,45,449,45],[448,2,448,4],[449,2,449,4],[447,32,449,32],[447,33,449,33],[447,34,449,34],[447,39,449,39],[447,5,449,5],[447,6,449,6],[447,7,449,7],[447,8,449,8],[447,9,449,9],[447,10,449,10],[448,25,448,27],[449,25,449,27],[447,11,449,11],[447,16,449,16],[447,17,449,17],[447,18,449,18],[447,19,449,19],[447,20,449,20],[448,13,448,15],[449,13,449,15],[447,40,449,40],[447,41,449,41],[448,36,448,38],[449,36,449,38],[447,21,449,21],[447,22,449,22],[447,28,449,28],[447,29,449,29],[447,30,449,30],[442,45,444,45],[443,2,443,4],[444,2,444,4],[442,32,444,32],[442,33,444,33],[442,34,444,34],[442,39,444,39],[442,40,444,40],[442,41,444,41],[443,36,443,38],[444,36,444,38],[442,21,444,21],[442,22,444,22],[442,28,444,28],[442,29,444,29],[442,30,444,30],[442,31,444,31],[442,42,444,42],[442,43,444,43],[442,44,444,44],[442,16,444,16],[442,17,444,17],[442,18,444,18],[442,19,444,19],[438,6,438,10],[438,17,438,21],[438,29,438,33],[438,40,438,44],[439,5,439,11],[439,16,439,22],[439,28,439,34],[439,39,439,45],[440,2,440,4],[440,13,440,15],[440,25,440,27],[440,36,440,38],[441,5,441,11],[441,16,441,22],[441,28,441,34],[441,39,441,45],[442,5,444,5],[442,6,444,6],[442,7,444,7],[442,8,444,8],[442,9,444,9],[442,10,444,10],[443,25,443,27],[444,25,444,27],[442,11,444,11],[443,13,443,15],[444,13,444,15],[442,20,444,20],[423,40,424,40],[423,41,424,41],[430,2,430,11],[430,13,430,22],[430,25,430,34],[430,36,430,45],[423,17,424,17],[423,18,424,18],[431,2,431,11],[431,13,431,22],[431,25,431,34],[431,36,431,45],[433,2,433,11],[433,13,433,22],[433,25,433,34],[433,36,433,45],[435,5,435,6],[435,16,435,17],[435,28,435,29],[435,39,435,40],[420,2,420,4],[420,13,420,15],[420,25,420,27],[420,36,420,38],[421,2,422,4],[421,5,422,5],[421,6,422,6],[421,7,422,7],[421,13,422,15],[421,16,422,16],[421,40,422,40],[421,41,422,41],[423,2,424,4],[423,5,424,5],[423,6,424,6],[423,7,424,7],[423,13,424,15],[423,16,424,16],[421,17,422,17],[421,18,422,18],[423,25,424,27],[423,28,424,28],[423,29,424,29],[423,30,424,30],[421,36,422,38],[421,39,422,39],[421,25,422,27],[421,28,422,28],[421,29,422,29],[421,30,422,30],[423,36,424,38],[423,39,424,39],[414,31,416,31],[414,42,416,42],[414,43,416,43],[414,44,416,44],[414,45,416,45],[415,2,415,4],[416,2,416,4],[414,32,416,32],[414,33,416,33],[414,34,416,34],[414,39,416,39],[414,5,416,5],[414,6,416,6],[414,7,416,7],[414,8,416,8],[414,9,416,9],[414,10,416,10],[415,25,415,27],[416,25,416,27],[414,11,416,11],[414,16,416,16],[414,17,416,17],[414,18,416,18],[414,19,416,19],[414,20,416,20],[415,13,415,15],[416,13,416,15],[414,40,416,40],[414,41,416,41],[415,36,415,38],[416,36,416,38],[414,21,416,21],[414,22,416,22],[414,28,416,28],[414,29,416,29],[414,30,416,30],[409,45,411,45],[410,2,410,4],[411,2,411,4],[409,32,411,32],[409,33,411,33],[409,34,411,34],[409,39,411,39],[409,40,411,40],[409,41,411,41],[410,36,410,38],[411,36,411,38],[409,21,411,21],[409,22,411,22],[409,28,411,28],[409,29,411,29],[409,30,411,30],[409,31,411,31],[409,42,411,42],[409,43,411,43],[409,44,411,44],[409,16,411,16],[409,17,411,17],[409,18,411,18],[409,19,411,19],[405,6,405,10],[405,17,405,21],[405,29,405,33],[405,40,405,44],[406,5,406,11],[406,16,406,22],[406,28,406,34],[406,39,406,45],[407,2,407,4],[407,13,407,15],[407,25,407,27],[407,36,407,38],[408,5,408,11],[408,16,408,22],[408,28,408,34],[408,39,408,45],[409,5,411,5],[409,6,411,6],[409,7,411,7],[409,8,411,8],[409,9,411,9],[409,10,411,10],[410,25,410,27],[411,25,411,27],[409,11,411,11],[410,13,410,15],[411,13,411,15],[409,20,411,20],[390,40,391,40],[390,41,391,41],[397,2,397,11],[397,13,397,22],[397,25,397,34],[397,36,397,45],[390,17,391,17],[390,18,391,18],[398,2,398,11],[398,13,398,22],[398,25,398,34],[398,36,398,45],[400,2,400,11],[400,13,400,22],[400,25,400,34],[400,36,400,45],[402,5,402,6],[402,16,402,17],[402,28,402,29],[402,39,402,40],[387,2,387,4],[387,13,387,15],[387,25,387,27],[387,36,387,38],[388,2,389,4],[388,5,389,5],[388,6,389,6],[388,7,389,7],[388,13,389,15],[388,16,389,16],[388,40,389,40],[388,41,389,41],[390,2,391,4],[390,5,391,5],[390,6,391,6],[390,7,391,7],[390,13,391,15],[390,16,391,16],[388,17,389,17],[388,18,389,18],[390,25,391,27],[390,28,391,28],[390,29,391,29],[390,30,391,30],[388,36,389,38],[388,39,389,39],[388,25,389,27],[388,28,389,28],[388,29,389,29],[388,30,389,30],[390,36,391,38],[390,39,391,39],[381,31,383,31],[381,42,383,42],[381,43,383,43],[381,44,383,44],[381,45,383,45],[382,2,382,4],[383,2,383,4],[381,32,383,32],[381,33,383,33],[381,34,383,34],[381,39,383,39],[381,5,383,5],[381,6,383,6],[381,7,383,7],[381,8,383,8],[381,9,383,9],[381,10,383,10],[382,25,382,27],[383,25,383,27],[381,11,383,11],[381,16,383,16],[381,17,383,17],[381,18,383,18],[381,19,383,19],[381,20,383,20],[382,13,382,15],[383,13,383,15],[381,40,383,40],[381,41,383,41],[382,36,382,38],[383,36,383,38],[381,21,383,21],[381,22,383,22],[381,28,383,28],[381,29,383,29],[381,30,383,30],[376,45,378,45],[377,2,377,4],[378,2,378,4],[376,32,378,32],[376,33,378,33],[376,34,378,34],[376,39,378,39],[376,40,378,40],[376,41,378,41],[377,36,377,38],[378,36,378,38],[376,21,378,21],[376,22,378,22],[376,28,378,28],[376,29,378,29],[376,30,378,30],[376,31,378,31],[376,42,378,42],[376,43,378,43],[376,44,378,44],[376,16,378,16],[376,17,378,17],[376,18,378,18],[376,19,378,19],[372,6,372,10],[372,17,372,21],[372,29,372,33],[372,40,372,44],[373,5,373,11],[373,16,373,22],[373,28,373,34],[373,39,373,45],[374,2,374,4],[374,13,374,15],[374,25,374,27],[374,36,374,38],[375,5,375,11],[375,16,375,22],[375,28,375,34],[375,39,375,45],[376,5,378,5],[376,6,378,6],[376,7,378,7],[376,8,378,8],[376,9,378,9],[376,10,378,10],[377,25,377,27],[378,25,378,27],[376,11,378,11],[377,13,377,15],[378,13,378,15],[376,20,378,20],[357,40,358,40],[357,41,358,41],[364,2,364,11],[364,13,364,22],[364,25,364,34],[364,36,364,45],[357,17,358,17],[357,18,358,18],[365,2,365,11],[365,13,365,22],[365,25,365,34],[365,36,365,45],[367,2,367,11],[367,13,367,22],[367,25,367,34],[367,36,367,45],[369,5,369,6],[369,16,369,17],[369,28,369,29],[369,39,369,40],[354,2,354,4],[354,13,354,15],[354,25,354,27],[354,36,354,38],[355,2,356,4],[355,5,356,5],[355,6,356,6],[355,7,356,7],[355,13,356,15],[355,16,356,16],[355,40,356,40],[355,41,356,41],[357,2,358,4],[357,5,358,5],[357,6,358,6],[357,7,358,7]],"merged_total":1962,"flags":["merged_cut"]}
[]
[null,"GROUPE A",{"$f":"IF(Prépa!$O$10<>0,Prépa!$O$10,\"\")","v":"Critérium Fédéral"},null,null,null,null,null,null,null,null,null,null,{"$f":"IF(Prépa!$O$10<>0,Prépa!$O$10,\"\")","v":"Critérium Fédéral"},null,null,null,null,null,null,null,null,null,null,"GROUPE A",{"$f":"IF(Prépa!$O$10<>0,Prépa!$O$10,\"\")","v":"Critérium Fédéral"},null,null,null,null,null,null,null,null,null,null,{"$f":"IF(Prépa!$O$10<>0,Prépa!$O$10,\"\")","v":"Critérium Fédéral"}]
[null,null,{"$f":"IF(Prépa!$D$14<>0,Prépa!$D$14,\"\")&IF(Prépa!$K$110<>0,\" - \"&Prépa!$K$110,\"\")","v":"TOURS - 10 Fevrier 2018"},null,null,null,null,null,null,null,null,null,null,{"$f":"IF(Prépa!$D$14<>0,Prépa!$D$14,\"\")&IF(Prépa!$K$110<>0,\" - \"&Prépa!$K$110,\"\")","v":"TOURS - 10 Fevrier 2018"},null,null,null,null,null,null,null,null,null,null,null,{"$f":"IF(Prépa!$D$14<>0,Prépa!$D$14,\"\")&IF(Prépa!$K$110<>0,\" - \"&Prépa!$K$110,\"\")","v":"TOURS - 10 Fevrier 2018"},null,null,null,null,null,null,null,null,null,null,{"$f":"IF(Prépa!$D$14<>0,Prépa!$D$14,\"\")&IF(Prépa!$K$110<>0,\" - \"&Prépa!$K$110,\"\")","v":"TOURS - 10 Fevrier 2018"}]
[]
[null,null,{"$f":"IF(Prépa!$O$72<>\"\",Prépa!$O$72,\"\")&IF(Prépa!$O$29<>\"\",\" - \"&Prépa!$O$29,\"\")","v":"OPEN Assis - Nat 2A Nord"},null,null,null,null,null,null,null,null,null,null,{"$f":"IF(Prépa!$O$72<>\"\",Prépa!$O$72,\"\")&IF(Prépa!$O$29<>\"\",\" - \"&Prépa!$O$29,\"\")","v":"OPEN Assis - Nat 2A Nord"},null,null,null,null,null,null,null,null,null,null,null,{"$f":"IF(Prépa!$O$72<>\"\",Prépa!$O$72,\"\")&IF(Prépa!$O$32<>\"\",\" - \"&Prépa!$O$32,\"\")","v":"OPEN Assis - Nat 2B Nord"},null,null,null,null,null,null,null,null,null,null,{"$f":"IF(Prépa!$O$72<>\"\",Prépa!$O$72,\"\")&IF(Prépa!$O$32<>\"\",\" - \"&Prépa!$O$32,\"\")","v":"OPEN Assis - Nat 2B Nord"}]
[]
[null,null,null,null,"Heure :",{"$f":"IF(Prépa!$W$6<>\"\",Prépa!$W$6,\"\")","v":"9h30"},null,null,"Table :",{"$f":"IF(Prépa!$X$6<>\"\",Prépa!$X$6,\"\")","v":1},null,null,null,null,null,"Heure :",{"$f":"IF(Prépa!$W$7<>\"\",Prépa!$W$7,\"\")","v":"9h30"},null,null,"Table :",{"$f":"IF(Prépa!$X$7<>\"\",Prépa!$X$7,\"\")","v":2},null,null,null,null,null,null,"Heure :",{"$f":"IF(Prépa!$AD$6<>\"\",Prépa!$AD$6,\"\")","v":"9h30"},null,null,"Table :",{"$f":"IF(Prépa!$AE$6<>\"\",Prépa!$AE$6,\"\")","v":5},null,null,null,null,null,"Heure :",{"$f":"IF(Prépa!$AD$7<>\"\",Prépa!$AD$7,\"\")","v":"9h30"},null,null,"Table :",{"$f":"IF(Prépa!$AE$7<>\"\",Prépa!$AE$7,\"\")","v":6}]
[]
[null,null,"Arbitre : ",null,null,null,null,null,null,null,null,null,null,"Arbitre : ",null,null,null,null,null,null,null,null,null,null,null,"Arbitre : ",null,null,null,null,null,null,null,null,null,null,"Arbitre : "]
[null,null,null,null,null,null,"1ère Partie",null,null,null,null,null,null,null,null,null,null,"2ème Partie",null,null,null,null,null,null,null,null,null,null,null,"1ère Partie",null,null,null,null,null,null,null,null,null,null,"2ème Partie"]
[null,null,null,null,null,"MANCHES",null,null,null,null,null,null,null,null,null,null,"MANCHES",null,null,null,null,null,null,null,null,null,null,null,"MANCHES",null,null,null,null,null,null,null,null,null,null,"MANCHES"]
[null,null,"PARTIE",null,null,1,2,3,4,5,6,7,null,"PARTIE",null,null,1,2,3,4,5,6,7,null,null,"PARTIE",null,null,1,2,3,4,5,6,7,null,"PARTIE",null,null,1,2,3,4,5,6,7]
[null,null,null,{"$f":"IF(AND('GROUPE A'!$C$27<>\"\",'GROUPE A'!$E$27<>\"\"),'GROUPE A'!$C$27&\" - \"&'GROUPE A'!$E$27,\"\")","v":"1 - 8"},null,"Premier service : GAUCHE - DROITE",null,null,null,null,null,null,null,null,{"$f":"IF(AND('GROUPE A'!$C$28<>\"\",'GROUPE A'!$E$28<>\"\"),'GROUPE A'!$C$28&\" - \"&'GROUPE A'!$E$28,\"\")","v":"2 - 7"},null,"Premier service : GAUCHE - DROITE",null,null,null,null,null,null,null,null,null,{"$f":"IF(AND('GROUPE B'!$C$27<>\"\",'GROUPE B'!$E$27<>\"\"),'GROUPE B'!$C$27&\" - \"&'GROUPE B'!$E$27,\"\")","v":"1 - 8"},null,"Premier service : GAUCHE - DROITE",null,null,null,null,null,null,null,null,{"$f":"IF(AND('GROUPE B'!$C$28<>\"\",'GROUPE B'!$E$28<>\"\"),'GROUPE B'!$C$28&\" - \"&'GROUPE B'!$E$28,\"\")","v":"2 - 7"},null,"Premier service : GAUCHE - DROITE"]
[null,null,{"$f":"IF(D13<>\"\",'GROUPE A'!$K$16,\"\")","v":1},null,null,null,null,null,null,null,null,null,null,{"$f":"IF(O13<>\"\",'GROUPE A'!$K$17,\"\")","v":2},null,null,null,null,null,null,null,null,null,null,null,{"$f":"IF(AA13<>\"\",'GROUPE B'!$K$16,\"\")","v":9},null,null,null,null,null,null,null,null,null,null,{"$f":"IF(AL13<>\"\",'GROUPE B'!$K$17,\"\")","v":16}]
[null,null,{"$f":"IF(C14<>\"\",VLOOKUP(C14,Liste!$C$17:$I$24,3,FALSE),\"\")","v":"RUTLER Sébastien"},null,null,null,null,null,null,null,null,null,null,{"$f":"IF(N14<>\"\",VLOOKUP(N14,Liste!$C$17:$I$24,3,FALSE),\"\")","v":"LE MOAL Bruno"},null,null,null,null,null,null,null,null,null,null,null,{"$f":"IF(Z14<>\"\",VLOOKUP(Z14,Liste!$C$30:$I$37,3,FALSE),\"\")","v":"PAPIRER Alan"},null,null,null,null,null,null,null,null,null,null,{"$f":"IF(AK14<>\"\",VLOOKUP(AK14,Liste!$C$30:$I$37,3,FALSE),\"\")","v":"HENOUX Frédéric"}]
[null,null,{"$f":"IF(C14<>\"\",VLOOKUP(C14,Liste!$C$17:$I$24,7,FALSE),\"\")","v":"PPN NEUVILLE EN FERRAIN"},null,null,null,null,null,null,null,null,null,null,{"$f":"IF(N14<>\"\",VLOOKUP(N14,Liste!$C$17:$I$24,7,FALSE),\"\")","v":"F.O.L.C.L.O."},null,null,null,null,null,null,null,null,null,null,null,{"$f":"IF(Z14<>\"\",VLOOKUP(Z14,Liste!$C$30:$I$37,7,FALSE),\"\")","v":"MOULINS LES METZ HANDISPORT"},null,null,null,null,null,null,null,null,null,null,{"$f":"IF(AK14<>\"\",VLOOKUP(AK14,Liste!$C$30:$I$37,7,FALSE),\"\")","v":"CTT CHATEAU THIERRY"}]
[]
[null,null,null,"contre",null,null,null,null,null,null,null,null,null,null,"contre",null,null,null,null,null,null,null,null,null,null,null,"contre",null,null,null,null,null,null,null,null,null,null,"contre"]
[null,null,{"$f":"IF(D13<>\"\",'GROUPE A'!$K$23,\"\")","v":8},null,null," ",null,null,null,null,null,null,null,{"$f":"IF(O13<>\"\",'GROUPE A'!$K$22,\"\")","v":7},null,null," ",null,null,null,null,null,null,null,null,{"$f":"IF(AA13<>\"\",'GROUPE B'!$K$23,\"\")","v":10},null,null," ",null,null,null,null,null,null,null,{"$f":"IF(AL13<>\"\",'GROUPE B'!$K$22,\"\")","v":15},null,null," "]
[null,null,{"$f":"IF(C19<>\"\",VLOOKUP(C19,Liste!$C$17:$I$24,3,FALSE),\"\")","v":"GOLLNISCH Laurent"},null,null,null,null,null,null,null,null,null,null,{"$f":"IF(N19<>\"\",VLOOKUP(N19,Liste!$C$17:$I$24,3,FALSE),\"\")","v":"FILLOU Marie-Christine"},null,null,null,null,null,null,null,null,null,null,null,{"$f":"IF(Z19<>\"\",VLOOKUP(Z19,Liste!$C$30:$I$37,3,FALSE),\"\")","v":"HASLE Stéphane"},null,null,null,null,null,null,null,null,null,null,{"$f":"IF(AK19<>\"\",VLOOKUP(AK19,Liste!$C$30:$I$37,3,FALSE),\"\")","v":"DUBOIS Gilles"}]
[null,null,{"$f":"IF(C19<>\"\",VLOOKUP(C19,Liste!$C$17:$I$24,7,FALSE),\"\")","v":"MOULINS LES METZ HANDISPORT"},null,null,null,null,null,null,null,null,null,null,{"$f":"IF(N19<>\"\",VLOOKUP(N19,Liste!$C$17:$I$24,7,FALSE),\"\")","v":"SAINT-AVERTIN STT"},null,null,null,null,null,null,null,null,null,null,null,{"$f":"IF(Z19<>\"\",VLOOKUP(Z19,Liste!$C$30:$I$37,7,FALSE),\"\")","v":"THORIGNE-FOUILLARD TT"},null,null,null,null,null,null,null,null,null,null,{"$f":"IF(AK19<>\"\",VLOOKUP(AK19,Liste!$C$30:$I$37,7,FALSE),\"\")","v":"LE MANS SARTHE TT"}]
[]
[]
[]
[null,null,"CARTONS",null,null,"J","J+R 1","J+R 2",null,null,null,null,null,"CARTONS",null,null,"J","J+R 1","J+R 2",null,null,null,null,null,null,"CARTONS",null,null,"J","J+R 1","J+R 2",null,null,null,null,null,"CARTONS",null,null,"J","J+R 1","J+R 2"]
[null,null,{"$f":"C15","v":"RUTLER Sébastien"},null,null,null,null,null,null,null,null,null,null,{"$f":"N15","v":"LE MOAL Bruno"},null,null,null,null,null,null,null,null,null,null,null,{"$f":"Z15","v":"PAPIRER Alan"},null,null,null,null,null,null,null,null,null,null,{"$f":"AK15","v":"HENOUX Frédéric"}]
[]
[null,null,{"$f":"C20","v":"GOLLNISCH Laurent"},null,null,null,null,null,null,null,null,null,null,{"$f":"N20","v":"FILLOU Marie-Christine"},null,null,null,null,null,null,null,null,null,null,null,{"$f":"Z20","v":"HASLE Stéphane"},null,null,null,null,null,null,null,null,null,null,{"$f":"AK20","v":"DUBOIS Gilles"}]
[]
[null,null,"Signature de l' Arbitre :",null,null,null,null,null,null,null,null,null,null,"Signature de l' Arbitre :",null,null,null,null,null,null,null,null,null,null,null,"Signature de l' Arbitre :",null,null,null,null,null,null,null,null,null,null,"Signature de l' Arbitre :"]
[]
[null,null,"Sitôt la partie terminée ; rapporter cette fiche à la table du Juge Arbitre;",null,null,null,null,null,null,null,null,null,null,"Sitôt la partie terminée ; rapporter cette fiche à la table du Juge Arbitre;",null,null,null,null,null,null,null,null,null,null,null,"Sitôt la partie terminée ; rapporter cette fiche à la table du Juge Arbitre;",null,null,null,null,null,null,null,null,null,null,"Sitôt la partie terminée ; rapporter cette fiche à la table du Juge Arbitre;"]
[]
[]
[null,null,{"$f":"IF(Prépa!$O$10<>0,Prépa!$O$10,\"\")","v":"Critérium Fédéral"},null,null,null,null,null,null,null,null,null,null,{"$f":"IF(Prépa!$O$10<>0,Prépa!$O$10,\"\")","v":"Critérium Fédéral"},null,null,null,null,null,null,null,null,null,null,null,{"$f":"IF(Prépa!$O$10<>0,Prépa!$O$10,\"\")","v":"Critérium Fédéral"},null,null,null,null,null,null,null,null,null,null,{"$f":"IF(Prépa!$O$10<>0,Prépa!$O$10,\"\")","v":"Critérium Fédéral"}]
[null,null,{"$f":"IF(Prépa!$D$14<>0,Prépa!$D$14,\"\")&IF(Prépa!$K$110<>0,\" - \"&Prépa!$K$110,\"\")","v":"TOURS - 10 Fevrier 2018"},null,null,null,null,null,null,null,null,null,null,{"$f":"IF(Prépa!$D$14<>0,Prépa!$D$14,\"\")&IF(Prépa!$K$110<>0,\" - \"&Prépa!$K$110,\"\")","v":"TOURS - 10 Fevrier 2018"},null,null,null,null,null,null,null,null,null,null,null,{"$f":"IF(Prépa!$D$14<>0,Prépa!$D$14,\"\")&IF(Prépa!$K$110<>0,\" - \"&Prépa!$K$110,\"\")","v":"TOURS - 10 Fevrier 2018"},null,null,null,null,null,null,null,null,null,null,{"$f":"IF(Prépa!$D$14<>0,Prépa!$D$14,\"\")&IF(Prépa!$K$110<>0,\" - \"&Prépa!$K$110,\"\")","v":"TOURS - 10 Fevrier 2018"}]
[]
[null,null,{"$f":"IF(Prépa!$O$72<>\"\",Prépa!$O$72,\"\")&IF(Prépa!$O$29<>\"\",\" - \"&Prépa!$O$29,\"\")","v":"OPEN Assis - Nat 2A Nord"},null,null,null,null,null,null,null,null,null,null,{"$f":"IF(Prépa!$O$72<>\"\",Prépa!$O$72,\"\")&IF(Prépa!$O$29<>\"\",\" - \"&Prépa!$O$29,\"\")","v":"OPEN Assis - Nat 2A Nord"},null,null,null,null,null,null,null,null,null,null,null,{"$f":"IF(Prépa!$O$72<>\"\",Prépa!$O$72,\"\")&IF(Prépa!$O$32<>\"\",\" - \"&Prépa!$O$32,\"\")","v":"OPEN Assis - Nat 2B Nord"},null,null,null,null,null,null,null,null,null,null,{"$f":"IF(Prépa!$O$72<>\"\",Prépa!$O$72,\"\")&IF(Prépa!$O$32<>\"\",\" - \"&Prépa!$O$32,\"\")","v":"OPEN Assis - Nat 2B Nord"}]
[]
[null,null,null,null,"Heure :",{"$f":"IF(Prépa!$W$8<>\"\",Prépa!$W$8,\"\")","v":"9h30"},null,null,"Table :",{"$f":"IF(Prépa!$X$8<>\"\",Prépa!$X$8,\"\")","v":3},null,null,null,null,null,"Heure :",{"$f":"IF(Prépa!$W$9<>\"\",Prépa!$W$9,\"\")","v":"9h30"},null,null,"Table :",{"$f":"IF(Prépa!$X$9<>\"\",Prépa!$X$9,\"\")","v":4},null,null,null,null,null,null,"Heure :",{"$f":"IF(Prépa!$AD$8<>\"\",Prépa!$AD$8,\"\")","v":"9h30"},null,null,"Table :",{"$f":"IF(Prépa!$AE$8<>\"\",Prépa!$AE$8,\"\")","v":7},null,null,null,null,null,"Heure :",{"$f":"IF(Prépa!$AD$9<>\"\",Prépa!$AD$9,\"\")","v":"9h30"},null,null,"Table :",{"$f":"IF(Prépa!$AE$9<>\"\",Prépa!$AE$9,\"\")","v":8}]
[]
[null,null,"Arbitre : ",null,null,null,null,null,null,null,null,null,null,"Arbitre : ",null,null,null,null,null,null,null,null,null,null,null,"Arbitre : ",null,null,null,null,null,null,null,null,null,null,"Arbitre : "]
[null,null,null,null,null,null,"3ème Partie",null,null,null,null,null,null,null,null,null,null,"4ème Partie",null,null,null,null,null,null,null,null,null,null,null,"3ème Partie",null,null,null,null,null,null,null,null,null,null,"4ème Partie"]
[null,null,null,null,null,"MANCHES",null,null,null,null,null,null,null,null,null,null,"MANCHES",null,null,null,null,null,null,null,null,null,null,null,"MANCHES",null,null,null,null,null,null,null,null,null,null,"MANCHES"]
[null,null,"PARTIE",null,null,1,2,3,4,5,6,7,null,"PARTIE",null,null,1,2,3,4,5,6,7,null,null,"PARTIE",null,null,1,2,3,4,5,6,7,null,"PARTIE",null,null,1,2,3,4,5,6,7]
[null,null,null,{"$f":"IF(AND('GROUPE A'!$C$29<>\"\",'GROUPE A'!$E$29<>\"\"),'GROUPE A'!$C$29&\" - \"&'GROUPE A'!$E$29,\"\")","v":"3 - 6"},null,"Premier service : GAUCHE - DROITE",null,null,null,null,null,null,null,null,{"$f":"IF(AND('GROUPE A'!$C$30<>\"\",'GROUPE A'!$E$30<>\"\"),'GROUPE A'!$C$30&\" - \"&'GROUPE A'!$E$30,\"\")","v":"4 - 5"},null,"Premier service : GAUCHE - DROITE",null,null,null,null,null,null,null,null,null,{"$f":"IF(AND('GROUPE B'!$C$29<>\"\",'GROUPE B'!$E$29<>\"\"),'GROUPE B'!$C$29&\" - \"&'GROUPE B'!$E$29,\"\")","v":"3 - 6"},null,"Premier service : GAUCHE - DROITE",null,null,null,null,null,null,null,null,{"$f":"IF(AND('GROUPE B'!$C$30<>\"\",'GROUPE B'!$E$30<>\"\"),'GROUPE B'!$C$30&\" - \"&'GROUPE B'!$E$30,\"\")","v":"4 - 5"},null,"Premier service : GAUCHE - DROITE"]
[null,null,{"$f":"IF(D46<>\"\",'GROUPE A'!$K$18,\"\")","v":3},null,null,null,null,null,null,null,null,null,null,{"$f":"IF(O46<>\"\",'GROUPE A'!$K$19,\"\")","v":4},null,null,null,null,null,null,null,null,null,null,null,{"$f":"IF(AA46<>\"\",'GROUPE B'!$K$18,\"\")","v":11},null,null,null,null,null,null,null,null,null,null,{"$f":"IF(AL46<>\"\",'GROUPE B'!$K$19,\"\")","v":13}]
[null,null,{"$f":"IF(C47<>\"\",VLOOKUP(C47,Liste!$C$17:$I$24,3,FALSE),\"\")","v":"PLET Victorien"},null,null,null,null,null,null,null,null,null,null,{"$f":"IF(N47<>\"\",VLOOKUP(N47,Liste!$C$17:$I$24,3,FALSE),\"\")","v":"DEFRENEIX Samuel"},null,null,null,null,null,null,null,null,null,null,null,{"$f":"IF(Z47<>\"\",VLOOKUP(Z47,Liste!$C$30:$I$37,3,FALSE),\"\")","v":"ADJAL Yorick"},null,null,null,null,null,null,null,null,null,null,{"$f":"IF(AK47<>\"\",VLOOKUP(AK47,Liste!$C$30:$I$37,3,FALSE),\"\")","v":"KERGOSIEN Arnaud"}]
[null,null,{"$f":"IF(C47<>\"\",VLOOKUP(C47,Liste!$C$17:$I$24,7,FALSE),\"\")","v":"US SAINT BERTHEVIN/SAINT LOUP"},null,null,null,null,null,null,null,null,null,null,{"$f":"IF(N47<>\"\",VLOOKUP(N47,Liste!$C$17:$I$24,7,FALSE),\"\")","v":"CTT DEOLS"},null,null,null,null,null,null,null,null,null,null,null,{"$f":"IF(Z47<>\"\",VLOOKUP(Z47,Liste!$C$30:$I$37,7,FALSE),\"\")","v":"A. VOISINS TT"},null,null,null,null,null,null,null,null,null,null,{"$f":"IF(AK47<>\"\",VLOOKUP(AK47,Liste!$C$30:$I$37,7,FALSE),\"\")","v":"F.O.L.C.L.O."}]
[]
[null,null,null,"contre",null,null,null,null,null,null,null,null,null,null,"contre",null,null,null,null,null,null,null,null,null,null,null,"contre",null,null,null,null,null,null,null,null,null,null,"contre"]
[null,null,{"$f":"IF(D46<>\"\",'GROUPE A'!$K$21,\"\")","v":6},null,null," ",null,null,null,null,null,null,null,{"$f":"IF(O46<>\"\",'GROUPE A'!$K$20,\"\")","v":5},null,null," ",null,null,null,null,null,null,null,null,{"$f":"IF(AA46<>\"\",'GROUPE B'!$K$21,\"\")","v":12},null,null," ",null,null,null,null,null,null,null,{"$f":"IF(AL46<>\"\",'GROUPE B'!$K$20,\"\")","v":14},null,null," "]
[null,null,{"$f":"IF(C52<>\"\",VLOOKUP(C52,Liste!$C$17:$I$24,3,FALSE),\"\")","v":"PIERROT Tristan"},null,null,null,null,null,null,null,null,null,null,{"$f":"IF(N52<>\"\",VLOOKUP(N52,Liste!$C$17:$I$24,3,FALSE),\"\")","v":"MANIER William"},null,null,null,null,null,null,null,null,null,null,null,{"$f":"IF(Z52<>\"\",VLOOKUP(Z52,Liste!$C$30:$I$37,3,FALSE),\"\")","v":"SIREAU GOSSIAUX Florence"},null,null,null,null,null,null,null,null,null,null,{"$f":"IF(AK52<>\"\",VLOOKUP(AK52,Liste!$C$30:$I$37,3,FALSE),\"\")","v":"BELTRAND Arnaud"}]
[null,null,{"$f":"IF(C52<>\"\",VLOOKUP(C52,Liste!$C$17:$I$24,7,FALSE),\"\")","v":"TT JOUE LES TOURS"},null,null,null,null,null,null,null,null,null,null,{"$f":"IF(N52<>\"\",VLOOKUP(N52,Liste!$C$17:$I$24,7,FALSE),\"\")","v":"CGL SUD OISE TT"},null,null,null,null,null,null,null,null,null,null,null,{"$f":"IF(Z52<>\"\",VLOOKUP(Z52,Liste!$C$30:$I$37,7,FALSE),\"\")","v":"A. VOISINS TT"},null,null,null,null,null,null,null,null,null,null,{"$f":"IF(AK52<>\"\",VLOOKUP(AK52,Liste!$C$30:$I$37,7,FALSE),\"\")","v":"TT JOUE LES TOURS"}]
[]
[]
[]
[null,null,"CARTONS",null,null,"J","J+R 1","J+R 2",null,null,null,null,null,"CARTONS",null,null,"J","J+R 1","J+R 2",null,null,null,null,null,null,"CARTONS",null,null,"J","J+R 1","J+R 2",null,null,null,null,null,"CARTONS",null,null,"J","J+R 1","J+R 2"]
[null,null,{"$f":"C48","v":"PLET Victorien"},null,null,null,null,null,null,null,null,null,null,{"$f":"N48","v":"DEFRENEIX Samuel"},null,null,null,null,null,null,null,null,null,null,null,{"$f":"Z48","v":"ADJAL Yorick"},null,null,null,null,null,null,null,null,null,null,{"$f":"AK48","v":"KERGOSIEN Arnaud"}]
[]
[null,null,{"$f":"C53","v":"PIERROT Tristan"},null,null,null,null,null,null,null,null,null,null,{"$f":"N53","v":"MANIER William"},null,null,null,null,null,null,null,null,null,null,null,{"$f":"Z53","v":"SIREAU GOSSIAUX Florence"},null,null,null,null,null,null,null,null,null,null,{"$f":"AK53","v":"BELTRAND Arnaud"}]
[]
[null,null,"Signature de l' Arbitre :",null,null,null,null,null,null,null,null,null,null,"Signature de l' Arbitre :",null,null,null,null,null,null,null,null,null,null,null,"Signature de l' Arbitre :",null,null,null,null,null,null,null,null,null,null,"Signature de l' Arbitre :"]
[]
[null,null,"Sitôt la partie terminée ; rapporter cette fiche à la table du Juge Arbitre;",null,null,null,null,null,null,null,null,null,null,"Sitôt la partie terminée ; rapporter cette fiche à la table du Juge Arbitre;",null,null,null,null,null,null,null,null,null,null,null,"Sitôt la partie terminée ; rapporter cette fiche à la table du Juge Arbitre;",null,null,null,null,null,null,null,null,null,null,"Sitôt la partie terminée ; rapporter cette fiche à la table du Juge Arbitre;"]
[]
[]
[null,null,{"$f":"IF(Prépa!$O$10<>0,Prépa!$O$10,\"\")","v":"Critérium Fédéral"},null,null,null,null,null,null,null,null,null,null,{"$f":"IF(Prépa!$O$10<>0,Prépa!$O$10,\"\")","v":"Critérium Fédéral"},null,null,null,null,null,null,null,null,null,null,null,{"$f":"IF(Prépa!$O$10<>0,Prépa!$O$10,\"\")","v":"Critérium Fédéral"},null,null,null,null,null,null,null,null,null,null,{"$f":"IF(Prépa!$O$10<>0,Prépa!$O$10,\"\")","v":"Critérium Fédéral"}]
[null,null,{"$f":"IF(Prépa!$D$14<>0,Prépa!$D$14,\"\")&IF(Prépa!$K$110<>0,\" - \"&Prépa!$K$110,\"\")","v":"TOURS - 10 Fevrier 2018"},null,null,null,null,null,null,null,null,null,null,{"$f":"IF(Prépa!$D$14<>0,Prépa!$D$14,\"\")&IF(Prépa!$K$110<>0,\" - \"&Prépa!$K$110,\"\")","v":"TOURS - 10 Fevrier 2018"},null,null,null,null,null,null,null,null,null,null,null,{"$f":"IF(Prépa!$D$14<>0,Prépa!$D$14,\"\")&IF(Prépa!$K$110<>0,\" - \"&Prépa!$K$110,\"\")","v":"TOURS - 10 Fevrier 2018"},null,null,null,null,null,null,null,null,null,null,{"$f":"IF(Prépa!$D$14<>0,Prépa!$D$14,\"\")&IF(Prépa!$K$110<>0,\" - \"&Prépa!$K$110,\"\")","v":"TOURS - 10 Fevrier 2018"}]
[]
[null,null,{"$f":"IF(Prépa!$O$72<>\"\",Prépa!$O$72,\"\")&IF(Prépa!$O$29<>\"\",\" - \"&Prépa!$O$29,\"\")","v":"OPEN Assis - Nat 2A Nord"},null,null,null,null,null,null,null,null,null,null,{"$f":"IF(Prépa!$O$72<>\"\",Prépa!$O$72,\"\")&IF(Prépa!$O$29<>\"\",\" - \"&Prépa!$O$29,\"\")","v":"OPEN Assis - Nat 2A Nord"},null,null,null,null,null,null,null,null,null,null,null,{"$f":"IF(Prépa!$O$72<>\"\",Prépa!$O$72,\"\")&IF(Prépa!$O$32<>\"\",\" - \"&Prépa!$O$32,\"\")","v":"OPEN Assis - Nat 2B Nord"},null,null,null,null,null,null,null,null,null,null,{"$f":"IF(Prépa!$O$72<>\"\",Prépa!$O$72,\"\")&IF(Prépa!$O$32<>\"\",\" - \"&Prépa!$O$32,\"\")","v":"OPEN Assis - Nat 2B Nord"}]
[]
[null,null,null,null,"Heure :",{"$f":"IF(Prépa!$W$13<>\"\",Prépa!$W$13,\"\")","v":"10h30"},null,null,"Table :",{"$f":"IF(Prépa!$X$13<>\"\",Prépa!$X$13,\"\")","v":5},null,null,null,null,null,"Heure :",{"$f":"IF(Prépa!$W$14<>\"\",Prépa!$W$14,\"\")","v":"10h30"},null,null,"Table :",{"$f":"IF(Prépa!$X$14<>\"\",Prépa!$X$14,\"\")","v":6},null,null,null,null,null,null,"Heure :",{"$f":"IF(Prépa!$AD$13<>\"\",Prépa!$AD$13,\"\")","v":"10h30"},null,null,"Table :",{"$f":"IF(Prépa!$AE$13<>\"\",Prépa!$AE$13,\"\")","v":1},null,null,null,null,null,"Heure :",{"$f":"IF(Prépa!$AD$14<>\"\",Prépa!$AD$14,\"\")","v":"10h30"},null,null,"Table :",{"$f":"IF(Prépa!$AE$14<>\"\",Prépa!$AE$14,\"\")","v":2}]
[]
[null,null,"Arbitre : ",null,null,null,null,null,null,null,null,null,null,"Arbitre : ",null,null,null,null,null,null,null,null,null,null,null,"Arbitre : ",null,null,null,null,null,null,null,null,null,null,"Arbitre : "]
[null,null,null,null,null,null,"5ème Partie",null,null,null,null,null,null,null,null,null,null,"6ème Partie",null,null,null,null,null,null,null,null,null,null,null,"5ème Partie",null,null,null,null,null,null,null,null,null,null,"6ème Partie"]
[null,null,null,null,null,"MANCHES",null,null,null,null,null,null,null,null,null,null,"MANCHES",null,null,null,null,null,null,null,null,null,null,null,"MANCHES",null,null,null,null,null,null,null,null,null,null,"MANCHES"]
[null,null,"PARTIE",null,null,1,2,3,4,5,6,7,null,"PARTIE",null,null,1,2,3,4,5,6,7,null,null,"PARTIE",null,null,1,2,3,4,5,6,7,null,"PARTIE",null,null,1,2,3,4,5,6,7]
[null,null,null,{"$f":"IF(AND('GROUPE A'!$C$31<>\"\",'GROUPE A'!$E$31<>\"\"),'GROUPE A'!$C$31&\" - \"&'GROUPE A'!$E$31,\"\")","v":"1 - 7"},null,"Premier service : GAUCHE - DROITE",null,null,null,null,null,null,null,null,{"$f":"IF(AND('GROUPE A'!$C$32<>\"\",'GROUPE A'!$E$32<>\"\"),'GROUPE A'!$C$32&\" - \"&'GROUPE A'!$E$32,\"\")","v":"6 - 8"},null,"Premier service : GAUCHE - DROITE",null,null,null,null,null,null,null,null,null,{"$f":"IF(AND('GROUPE B'!$C$31<>\"\",'GROUPE B'!$E$31<>\"\"),'GROUPE B'!$C$31&\" - \"&'GROUPE B'!$E$31,\"\")","v":"1 - 7"},null,"Premier service : GAUCHE - DROITE",null,null,null,null,null,null,null,null,{"$f":"IF(AND('GROUPE B'!$C$32<>\"\",'GROUPE B'!$E$32<>\"\"),'GROUPE B'!$C$32&\" - \"&'GROUPE B'!$E$32,\"\")","v":"6 - 8"},null,"Premier service : GAUCHE - DROITE"]
[null,null,{"$f":"IF(D79<>\"\",'GROUPE A'!$K$16,\"\")","v":1},null,null,null,null,null,null,null,null,null,null,{"$f":"IF(O79<>\"\",'GROUPE A'!$K$21,\"\")","v":6},null,null,null,null,null,null,null,null,null,null,null,{"$f":"IF(AA79<>\"\",'GROUPE B'!$K$16,\"\")","v":9},null,null,null,null,null,null,null,null,null,null,{"$f":"IF(AL79<>\"\",'GROUPE B'!$K$21,\"\")","v":12}]
[null,null,{"$f":"IF(C80<>\"\",VLOOKUP(C80,Liste!$C$17:$I$24,3,FALSE),\"\")","v":"RUTLER Sébastien"},null,null,null,null,null,null,null,null,null,null,{"$f":"IF(N80<>\"\",VLOOKUP(N80,Liste!$C$17:$I$24,3,FALSE),\"\")","v":"PIERROT Tristan"},null,null,null,null,null,null,null,null,null,null,null,{"$f":"IF(Z80<>\"\",VLOOKUP(Z80,Liste!$C$30:$I$37,3,FALSE),\"\")","v":"PAPIRER Alan"},null,null,null,null,null,null,null,null,null,null,{"$f":"IF(AK80<>\"\",VLOOKUP(AK80,Liste!$C$30:$I$37,3,FALSE),\"\")","v":"SIREAU GOSSIAUX Florence"}]
[null,null,{"$f":"IF(C80<>\"\",VLOOKUP(C80,Liste!$C$17:$I$24,7,FALSE),\"\")","v":"PPN NEUVILLE EN FERRAIN"},null,null,null,null,null,null,null,null,null,null,{"$f":"IF(N80<>\"\",VLOOKUP(N80,Liste!$C$17:$I$24,7,FALSE),\"\")","v":"TT JOUE LES TOURS"},null,null,null,null,null,null,null,null,null,null,null,{"$f":"IF(Z80<>\"\",VLOOKUP(Z80,Liste!$C$30:$I$37,7,FALSE),\"\")","v":"MOULINS LES METZ HANDISPORT"},null,null,null,null,null,null,null,null,null,null,{"$f":"IF(AK80<>\"\",VLOOKUP(AK80,Liste!$C$30:$I$37,7,FALSE),\"\")","v":"A. VOISINS TT"}]
[]
[null,null,null,"contre",null,null,null,null,null,null,null,null,null,null,"contre",null,null,null,null,null,null,null,null,null,null,null,"contre",null,null,null,null,null,null,null,null,null,null,"contre"]
[null,null,{"$f":"IF(D79<>\"\",'GROUPE A'!$K$22,\"\")","v":7},null,null," ",null,null,null,null,null,null,null,{"$f":"IF(O79<>\"\",'GROUPE A'!$K$23,\"\")","v":8},null,null," ",null,null,null,null,null,null,null,null,{"$f":"IF(AA79<>\"\",'GROUPE B'!$K$22,\"\")","v":15},null,null," ",null,null,null,null,null,null,null,{"$f":"IF(AL79<>\"\",'GROUPE B'!$K$23,\"\")","v":10},null,null," "]
[null,null,{"$f":"IF(C85<>\"\",VLOOKUP(C85,Liste!$C$17:$I$24,3,FALSE),\"\")","v":"FILLOU Marie-Christine"},null,null,null,null,null,null,null,null,null,null,{"$f":"IF(N85<>\"\",VLOOKUP(N85,Liste!$C$17:$I$24,3,FALSE),\"\")","v":"GOLLNISCH Laurent"},null,null,null,null,null,null,null,null,null,null,null,{"$f":"IF(Z85<>\"\",VLOOKUP(Z85,Liste!$C$30:$I$37,3,FALSE),\"\")","v":"DUBOIS Gilles"},null,null,null,null,null,null,null,null,null,null,{"$f":"IF(AK85<>\"\",VLOOKUP(AK85,Liste!$C$30:$I$37,3,FALSE),\"\")","v":"HASLE Stéphane"}]
[null,null,{"$f":"IF(C85<>\"\",VLOOKUP(C85,Liste!$C$17:$I$24,7,FALSE),\"\")","v":"SAINT-AVERTIN STT"},null,null,null,null,null,null,null,null,null,null,{"$f":"IF(N85<>\"\",VLOOKUP(N85,Liste!$C$17:$I$24,7,FALSE),\"\")","v":"MOULINS LES METZ HANDISPORT"},null,null,null,null,null,null,null,null,null,null,null,{"$f":"IF(Z85<>\"\",VLOOKUP(Z85,Liste!$C$30:$I$37,7,FALSE),\"\")","v":"LE MANS SARTHE TT"},null,null,null,null,null,null,null,null,null,null,{"$f":"IF(AK85<>\"\",VLOOKUP(AK85,Liste!$C$30:$I$37,7,FALSE),\"\")","v":"THORIGNE-FOUILLARD TT"}]
[]
[]
[]
[null,null,"CARTONS",null,null,"J","J+R 1","J+R 2",null,null,null,null,null,"CARTONS",null,null,"J","J+R 1","J+R 2",null,null,null,null,null,null,"CARTONS",null,null,"J","J+R 1","J+R 2",null,null,null,null,null,"CARTONS",null,null,"J","J+R 1","J+R 2"]
[null,null,{"$f":"C81","v":"RUTLER Sébastien"},null,null,null,null,null,null,null,null,null,null,{"$f":"N81","v":"PIERROT Tristan"},null,null,null,null,null,null,null,null,null,null,null,{"$f":"Z81","v":"PAPIRER Alan"},null,null,null,null,null,null,null,null,null,null,{"$f":"AK81","v":"SIREAU GOSSIAUX Florence"}]
[]
[null,null,{"$f":"C86","v":"FILLOU Marie-Christine"},null,null,null,null,null,null,null,null,null,null,{"$f":"N86","v":"GOLLNISCH Laurent"},null,null,null,null,null,null,null,null,null,null,null,{"$f":"Z86","v":"DUBOIS Gilles"},null,null,null,null,null,null,null,null,null,null,{"$f":"AK86","v":"HASLE Stéphane"}]
[]
[null,null,"Signature de l' Arbitre :",null,null,null,null,null,null,null,null,null,null,"Signature de l' Arbitre :",null,null,null,null,null,null,null,null,null,null,null,"Signature de l' Arbitre :",null,null,null,null,null,null,null,null,null,null,"Signature de l' Arbitre :"]
[]
[null,null,"Sitôt la partie terminée ; rapporter cette fiche à la table du Juge Arbitre;",null,null,null,null,null,null,null,null,null,null,"Sitôt la partie terminée ; rapporter cette fiche à la table du Juge Arbitre;",null,null,null,null,null,null,null,null,null,null,null,"Sitôt la partie terminée ; rapporter cette fiche à la table du Juge Arbitre;",null,null,null,null,null,null,null,null,null,null,"Sitôt la partie terminée ; rapporter cette fiche à la table du Juge Arbitre;"]
[]
[]
[null,null,{"$f":"IF(Prépa!$O$10<>0,Prépa!$O$10,\"\")","v":"Critérium Fédéral"},null,null,null,null,null,null,null,null,null,null,{"$f":"IF(Prépa!$O$10<>0,Prépa!$O$10,\"\")","v":"Critérium Fédéral"},null,null,null,null,null,null,null,null,null,null,null,{"$f":"IF(Prépa!$O$10<>0,Prépa!$O$10,\"\")","v":"Critérium Fédéral"},null,null,null,null,null,null,null,null,null,null,{"$f":"IF(Prépa!$O$10<>0,Prépa!$O$10,\"\")","v":"Critérium Fédéral"}]
[null,null,{"$f":"IF(Prépa!$D$14<>0,Prépa!$D$14,\"\")&IF(Prépa!$K$110<>0,\" - \"&Prépa!$K$110,\"\")","v":"TOURS - 10 Fevrier 2018"},null,null,null,null,null,null,null,null,null,null,{"$f":"IF(Prépa!$D$14<>0,Prépa!$D$14,\"\")&IF(Prépa!$K$110<>0,\" - \"&Prépa!$K$110,\"\")","v":"TOURS - 10 Fevrier 2018"},null,null,null,null,null,null,null,null,null,null,null,{"$f":"IF(Prépa!$D$14<>0,Prépa!$D$14,\"\")&IF(Prépa!$K$110<>0,\" - \"&Prépa!$K$110,\"\")","v":"TOURS - 10 Fevrier 2018"},null,null,null,null,null,null,null,null,null,null,{"$f":"IF(Prépa!$D$14<>0,Prépa!$D$14,\"\")&IF(Prépa!$K$110<>0,\" - \"&Prépa!$K$110,\"\")","v":"TOURS - 10 Fevrier 2018"}]
[]
[null,null,{"$f":"IF(Prépa!$O$72<>\"\",Prépa!$O$72,\"\")&IF(Prépa!$O$29<>\"\",\" - \"&Prépa!$O$29,\"\")","v":"OPEN Assis - Nat 2A Nord"},null,null,null,null,null,null,null,null,null,null,{"$f":"IF(Prépa!$O$72<>\"\",Prépa!$O$72,\"\")&IF(Prépa!$O$29<>\"\",\" - \"&Prépa!$O$29,\"\")","v":"OPEN Assis - Nat 2A Nord"},null,null,null,null,null,null,null,null,null,null,null,{"$f":"IF(Prépa!$O$72<>\"\",Prépa!$O$72,\"\")&IF(Prépa!$O$32<>\"\",\" - \"&Prépa!$O$32,\"\")","v":"OPEN Assis - Nat 2B Nord"},null,null,null,null,null,null,null,null,null,null,{"$f":"IF(Prépa!$O$72<>\"\",Prépa!$O$72,\"\")&IF(Prépa!$O$32<>\"\",\" - \"&Prépa!$O$32,\"\")","v":"OPEN Assis - Nat 2B Nord"}]
[]
[null,null,null,null,"Heure :",{"$f":"IF(Prépa!$W$15<>\"\",Prépa!$W$15,\"\")","v":"10h30"},null,null,"Table :",{"$f":"IF(Prépa!$X$15<>\"\",Prépa!$X$15,\"\")","v":7},null,null,null,null,null,"Heure :",{"$f":"IF(Prépa!$W$16<>\"\",Prépa!$W$16,\"\")","v":"10h30"},null,null,"Table :",{"$f":"IF(Prépa!$X$16<>\"\",Prépa!$X$16,\"\")","v":8},null,null,null,null,null,null,"Heure :",{"$f":"IF(Prépa!$AD$15<>\"\",Prépa!$AD$15,\"\")","v":"10h30"},null,null,"Table :",{"$f":"IF(Prépa!$AE$15<>\"\",Prépa!$AE$15,\"\")","v":3},null,null,null,null,null,"Heure :",{"$f":"IF(Prépa!$AD$16<>\"\",Prépa!$AD$16,\"\")","v":"10h30"},null,null,"Table :",{"$f":"IF(Prépa!$AE$16<>\"\",Prépa!$AE$16,\"\")","v":4}]
[]
[null,null,"Arbitre : ",null,null,null,null,null,null,null,null,null,null,"Arbitre : ",null,null,null,null,null,null,null,null,null,null,null,"Arbitre : ",null,null,null,null,null,null,null,null,null,null,"Arbitre : "]
[null,null,null,null,null,null,"7ème Partie",null,null,null,null,null,null,null,null,null,null,"8ème Partie",null,null,null,null,null,null,null,null,null,null,null,"7ème Partie",null,null,null,null,null,null,null,null,null,null,"8ème Partie"]
[null,null,null,null,null,"MANCHES",null,null,null,null,null,null,null,null,null,null,"MANCHES",null,null,null,null,null,null,null,null,null,null,null,"MANCHES",null,null,null,null,null,null,null,null,null,null,"MANCHES"]
[null,null,"PARTIE",null,null,1,2,3,4,5,6,7,null,"PARTIE",null,null,1,2,3,4,5,6,7,null,null,"PARTIE",null,null,1,2,3,4,5,6,7,null,"PARTIE",null,null,1,2,3,4,5,6,7]
[null,null,null,{"$f":"IF(AND('GROUPE A'!$C$33<>\"\",'GROUPE A'!$E$33<>\"\"),'GROUPE A'!$C$33&\" - \"&'GROUPE A'!$E$33,\"\")","v":"2 - 5"},null,"Premier service : GAUCHE - DROITE",null,null,null,null,null,null,null,null,{"$f":"IF(AND('GROUPE A'!$C$34<>\"\",'GROUPE A'!$E$34<>\"\"),'GROUPE A'!$C$34&\" - \"&'GROUPE A'!$E$34,\"\")","v":"3 - 4"},null,"Premier service : GAUCHE - DROITE",null,null,null,null,null,null,null,null,null,{"$f":"IF(AND('GROUPE B'!$C$33<>\"\",'GROUPE B'!$E$33<>\"\"),'GROUPE B'!$C$33&\" - \"&'GROUPE B'!$E$33,\"\")","v":"2 - 5"},null,"Premier service : GAUCHE - DROITE",null,null,null,null,null,null,null,null,{"$f":"IF(AND('GROUPE B'!$C$34<>\"\",'GROUPE B'!$E$34<>\"\"),'GROUPE B'!$C$34&\" - \"&'GROUPE B'!$E$34,\"\")","v":"3 - 4"},null,"Premier service : GAUCHE - DROITE"]
[null,null,{"$f":"IF(D112<>\"\",'GROUPE A'!$K$17,\"\")","v":2},null,null,null,null,null,null,null,null,null,null,{"$f":"IF(O112<>\"\",'GROUPE A'!$K$18,\"\")","v":3},null,null,null,null,null,null,null,null,null,null,null,{"$f":"IF(AA112<>\"\",'GROUPE B'!$K$17,\"\")","v":16},null,null,null,null,null,null,null,null,null,null,{"$f":"IF(AL112<>\"\",'GROUPE B'!$K$18,\"\")","v":11}]
[null,null,{"$f":"IF(C113<>\"\",VLOOKUP(C113,Liste!$C$17:$I$24,3,FALSE),\"\")","v":"LE MOAL Bruno"},null,null,null,null,null,null,null,null,null,null,{"$f":"IF(N113<>\"\",VLOOKUP(N113,Liste!$C$17:$I$24,3,FALSE),\"\")","v":"PLET Victorien"},null,null,null,null,null,null,null,null,null,null,null,{"$f":"IF(Z113<>\"\",VLOOKUP(Z113,Liste!$C$30:$I$37,3,FALSE),\"\")","v":"HENOUX Frédéric"},null,null,null,null,null,null,null,null,null,null,{"$f":"IF(AK113<>\"\",VLOOKUP(AK113,Liste!$C$30:$I$37,3,FALSE),\"\")","v":"ADJAL Yorick"}]
[null,null,{"$f":"IF(C113<>\"\",VLOOKUP(C113,Liste!$C$17:$I$24,7,FALSE),\"\")","v":"F.O.L.C.L.O."},null,null,null,null,null,null,null,null,null,null,{"$f":"IF(N113<>\"\",VLOOKUP(N113,Liste!$C$17:$I$24,7,FALSE),\"\")","v":"US SAINT BERTHEVIN/SAINT LOUP"},null,null,null,null,null,null,null,null,null,null,null,{"$f":"IF(Z113<>\"\",VLOOKUP(Z113,Liste!$C$30:$I$37,7,FALSE),\"\")","v":"CTT CHATEAU THIERRY"},null,null,null,null,null,null,null,null,null,null,{"$f":"IF(AK113<>\"\",VLOOKUP(AK113,Liste!$C$30:$I$37,7,FALSE),\"\")","v":"A. VOISINS TT"}]
[]
[null,null,null,"contre",null,null,null,null,null,null,null,null,null,null,"contre",null,null,null,null,null,null,null,null,null,null,null,"contre",null,null,null,null,null,null,null,null,null,null,"contre"]
[null,null,{"$f":"IF(D112<>\"\",'GROUPE A'!$K$20,\"\")","v":5},null,null," ",null,null,null,null,null,null,null,{"$f":"IF(O112<>\"\",'GROUPE A'!$K$19,\"\")","v":4},null,null," ",null,null,null,null,null,null,null,null,{"$f":"IF(AA112<>\"\",'GROUPE B'!$K$20,\"\")","v":14},null,null," ",null,null,null,null,null,null,null,{"$f":"IF(AL112<>\"\",'GROUPE B'!$K$19,\"\")","v":13},null,null," "]
[null,null,{"$f":"IF(C118<>\"\",VLOOKUP(C118,Liste!$C$17:$I$24,3,FALSE),\"\")","v":"MANIER William"},null,null,null,null,null,null,null,null,null,null,{"$f":"IF(N118<>\"\",VLOOKUP(N118,Liste!$C$17:$I$24,3,FALSE),\"\")","v":"DEFRENEIX Samuel"},null,null,null,null,null,null,null,null,null,null,null,{"$f":"IF(Z118<>\"\",VLOOKUP(Z118,Liste!$C$30:$I$37,3,FALSE),\"\")","v":"BELTRAND Arnaud"},null,null,null,null,null,null,null,null,null,null,{"$f":"IF(AK118<>\"\",VLOOKUP(AK118,Liste!$C$30:$I$37,3,FALSE),\"\")","v":"KERGOSIEN Arnaud"}]
[null,null,{"$f":"IF(C118<>\"\",VLOOKUP(C118,Liste!$C$17:$I$24,7,FALSE),\"\")","v":"CGL SUD OISE TT"},null,null,null,null,null,null,null,null,null,null,{"$f":"IF(N118<>\"\",VLOOKUP(N118,Liste!$C$17:$I$24,7,FALSE),\"\")","v":"CTT DEOLS"},null,null,null,null,null,null,null,null,null,null,null,{"$f":"IF(Z118<>\"\",VLOOKUP(Z118,Liste!$C$30:$I$37,7,FALSE),\"\")","v":"TT JOUE LES TOURS"},null,null,null,null,null,null,null,null,null,null,{"$f":"IF(AK118<>\"\",VLOOKUP(AK118,Liste!$C$30:$I$37,7,FALSE),\"\")","v":"F.O.L.C.L.O."}]
[]
[]
[]
[null,null,"CARTONS",null,null,"J","J+R 1","J+R 2",null,null,null,null,null,"CARTONS",null,null,"J","J+R 1","J+R 2",null,null,null,null,null,null,"CARTONS",null,null,"J","J+R 1","J+R 2",null,null,null,null,null,"CARTONS",null,null,"J","J+R 1","J+R 2"]
[null,null,{"$f":"C114","v":"LE MOAL Bruno"},null,null,null,null,null,null,null,null,null,null,{"$f":"N114","v":"PLET Victorien"},null,null,null,null,null,null,null,null,null,null,null,{"$f":"Z114","v":"HENOUX Frédéric"},null,null,null,null,null,null,null,null,null,null,{"$f":"AK114","v":"ADJAL Yorick"}]
[]
[null,null,{"$f":"C119","v":"MANIER William"},null,null,null,null,null,null,null,null,null,null,{"$f":"N119","v":"DEFRENEIX Samuel"},null,null,null,null,null,null,null,null,null,null,null,{"$f":"Z119","v":"BELTRAND Arnaud"},null,null,null,null,null,null,null,null,null,null,{"$f":"AK119","v":"KERGOSIEN Arnaud"}]
[]
[null,null,"Signature de l' Arbitre :",null,null,null,null,null,null,null,null,null,null,"Signature de l' Arbitre :",null,null,null,null,null,null,null,null,null,null,null,"Signature de l' Arbitre :",null,null,null,null,null,null,null,null,null,null,"Signature de l' Arbitre :"]
[]
[null,null,"Sitôt la partie terminée ; rapporter cette fiche à la table du Juge Arbitre;",null,null,null,null,null,null,null,null,null,null,"Sitôt la partie terminée ; rapporter cette fiche à la table du Juge Arbitre;",null,null,null,null,null,null,null,null,null,null,null,"Sitôt la partie terminée ; rapporter cette fiche à la table du Juge Arbitre;",null,null,null,null,null,null,null,null,null,null,"Sitôt la partie terminée ; rapporter cette fiche à la table du Juge Arbitre;"]
[]
[]
[null,null,{"$f":"IF(Prépa!$O$10<>0,Prépa!$O$10,\"\")","v":"Critérium Fédéral"},null,null,null,null,null,null,null,null,null,null,{"$f":"IF(Prépa!$O$10<>0,Prépa!$O$10,\"\")","v":"Critérium Fédéral"},null,null,null,null,null,null,null,null,null,null,null,{"$f":"IF(Prépa!$O$10<>0,Prépa!$O$10,\"\")","v":"Critérium Fédéral"},null,null,null,null,null,null,null,null,null,null,{"$f":"IF(Prépa!$O$10<>0,Prépa!$O$10,\"\")","v":"Critérium Fédéral"}]
[null,null,{"$f":"IF(Prépa!$D$14<>0,Prépa!$D$14,\"\")&IF(Prépa!$K$110<>0,\" - \"&Prépa!$K$110,\"\")","v":"TOURS - 10 Fevrier 2018"},null,null,null,null,null,null,null,null,null,null,{"$f":"IF(Prépa!$D$14<>0,Prépa!$D$14,\"\")&IF(Prépa!$K$110<>0,\" - \"&Prépa!$K$110,\"\")","v":"TOURS - 10 Fevrier 2018"},null,null,null,null,null,null,null,null,null,null,null,{"$f":"IF(Prépa!$D$14<>0,Prépa!$D$14,\"\")&IF(Prépa!$K$110<>0,\" - \"&Prépa!$K$110,\"\")","v":"TOURS - 10 Fevrier 2018"},null,null,null,null,null,null,null,null,null,null,{"$f":"IF(Prépa!$D$14<>0,Prépa!$D$14,\"\")&IF(Prépa!$K$110<>0,\" - \"&Prépa!$K$110,\"\")","v":"TOURS - 10 Fevrier 2018"}]
[]
[null,null,{"$f":"IF(Prépa!$O$72<>\"\",Prépa!$O$72,\"\")&IF(Prépa!$O$29<>\"\",\" - \"&Prépa!$O$29,\"\")","v":"OPEN Assis - Nat 2A Nord"},null,null,null,null,null,null,null,null,null,null,{"$f":"IF(Prépa!$O$72<>\"\",Prépa!$O$72,\"\")&IF(Prépa!$O$29<>\"\",\" - \"&Prépa!$O$29,\"\")","v":"OPEN Assis - Nat 2A Nord"},null,null,null,null,null,null,null,null,null,null,null,{"$f":"IF(Prépa!$O$72<>\"\",Prépa!$O$72,\"\")&IF(Prépa!$O$32<>\"\",\" - \"&Prépa!$O$32,\"\")","v":"OPEN Assis - Nat 2B Nord"},null,null,null,null,null,null,null,null,null,null,{"$f":"IF(Prépa!$O$72<>\"\",Prépa!$O$72,\"\")&IF(Prépa!$O$32<>\"\",\" - \"&Prépa!$O$32,\"\")","v":"OPEN Assis - Nat 2B Nord"}]
[]
[null,null,null,null,"Heure :",{"$f":"IF(Prépa!$W$20<>\"\",Prépa!$W$20,\"\")","v":"11h30"},null,null,"Table :",{"$f":"IF(Prépa!$X$20<>\"\",Prépa!$X$20,\"\")","v":2},null,null,null,null,null,"Heure :",{"$f":"IF(Prépa!$W$21<>\"\",Prépa!$W$21,\"\")","v":"11h30"},null,null,"Table :",{"$f":"IF(Prépa!$X$21<>\"\",Prépa!$X$21,\"\")","v":3},null,null,null,null,null,null,"Heure :",{"$f":"IF(Prépa!$AD$20<>\"\",Prépa!$AD$20,\"\")","v":"11h30"},null,null,"Table :",{"$f":"IF(Prépa!$AE$20<>\"\",Prépa!$AE$20,\"\")","v":6},null,null,null,null,null,"Heure :",{"$f":"IF(Prépa!$AD$21<>\"\",Prépa!$AD$21,\"\")","v":"11h30"},null,null,"Table :",{"$f":"IF(Prépa!$AE$21<>\"\",Prépa!$AE$21,\"\")","v":7}]
[]
[null,null,"Arbitre : ",null,null,null,null,null,null,null,null,null,null,"Arbitre : ",null,null,null,null,null,null,null,null,null,null,null,"Arbitre : ",null,null,null,null,null,null,null,null,null,null,"Arbitre : "]
[null,null,null,null,null,null,"9ème Partie",null,null,null,null,null,null,null,null,null,null,"10ème Partie",null,null,null,null,null,null,null,null,null,null,null,"9ème Partie",null,null,null,null,null,null,null,null,null,null,"10ème Partie"]
[null,null,null,null,null,"MANCHES",null,null,null,null,null,null,null,null,null,null,"MANCHES",null,null,null,null,null,null,null,null,null,null,null,"MANCHES",null,null,null,null,null,null,null,null,null,null,"MANCHES"]
[null,null,"PARTIE",null,null,1,2,3,4,5,6,7,null,"PARTIE",null,null,1,2,3,4,5,6,7,null,null,"PARTIE",null,null,1,2,3,4,5,6,7,null,"PARTIE",null,null,1,2,3,4,5,6,7]
[null,null,null,{"$f":"IF(AND('GROUPE A'!$C$35<>\"\",'GROUPE A'!$E$35<>\"\"),'GROUPE A'!$C$35&\" - \"&'GROUPE A'!$E$35,\"\")","v":"1 - 6"},null,"Premier service : GAUCHE - DROITE",null,null,null,null,null,null,null,null,{"$f":"IF(AND('GROUPE A'!$C$36<>\"\",'GROUPE A'!$E$36<>\"\"),'GROUPE A'!$C$36&\" - \"&'GROUPE A'!$E$36,\"\")","v":"5 - 7"},null,"Premier service : GAUCHE - DROITE",null,null,null,null,null,null,null,null,null,{"$f":"IF(AND('GROUPE B'!$C$35<>\"\",'GROUPE B'!$E$35<>\"\"),'GROUPE B'!$C$35&\" - \"&'GROUPE B'!$E$35,\"\")","v":"1 - 6"},null,"Premier service : GAUCHE - DROITE",null,null,null,null,null,null,null,null,{"$f":"IF(AND('GROUPE B'!$C$36<>\"\",'GROUPE B'!$E$36<>\"\"),'GROUPE B'!$C$36&\" - \"&'GROUPE B'!$E$36,\"\")","v":"5 - 7"},null,"Premier service : GAUCHE - DROITE"]
[null,null,{"$f":"IF(D145<>\"\",'GROUPE A'!$K$16,\"\")","v":1},null,null,null,null,null,null,null,null,null,null,{"$f":"IF(O145<>\"\",'GROUPE A'!$K$20,\"\")","v":5},null,null,null,null,null,null,null,null,null,null,null,{"$f":"IF(AA145<>\"\",'GROUPE B'!$K$16,\"\")","v":9},null,null,null,null,null,null,null,null,null,null,{"$f":"IF(AL145<>\"\",'GROUPE B'!$K$20,\"\")","v":14}]
[null,null,{"$f":"IF(C146<>\"\",VLOOKUP(C146,Liste!$C$17:$I$24,3,FALSE),\"\")","v":"RUTLER Sébastien"},null,null,null,null,null,null,null,null,null,null,{"$f":"IF(N146<>\"\",VLOOKUP(N146,Liste!$C$17:$I$24,3,FALSE),\"\")","v":"MANIER William"},null,null,null,null,null,null,null,null,null,null,null,{"$f":"IF(Z146<>\"\",VLOOKUP(Z146,Liste!$C$30:$I$37,3,FALSE),\"\")","v":"PAPIRER Alan"},null,null,null,null,null,null,null,null,null,null,{"$f":"IF(AK146<>\"\",VLOOKUP(AK146,Liste!$C$30:$I$37,3,FALSE),\"\")","v":"BELTRAND Arnaud"}]
[null,null,{"$f":"IF(C146<>\"\",VLOOKUP(C146,Liste!$C$17:$I$24,7,FALSE),\"\")","v":"PPN NEUVILLE EN FERRAIN"},null,null,null,null,null,null,null,null,null,null,{"$f":"IF(N146<>\"\",VLOOKUP(N146,Liste!$C$17:$I$24,7,FALSE),\"\")","v":"CGL SUD OISE TT"},null,null,null,null,null,null,null,null,null,null,null,{"$f":"IF(Z146<>\"\",VLOOKUP(Z146,Liste!$C$30:$I$37,7,FALSE),\"\")","v":"MOULINS LES METZ HANDISPORT"},null,null,null,null,null,null,null,null,null,null,{"$f":"IF(AK146<>\"\",VLOOKUP(AK146,Liste!$C$30:$I$37,7,FALSE),\"\")","v":"TT JOUE LES TOURS"}]
[]
[null,null,null,"contre",null,null,null,null,null,null,null,null,null,null,"contre",null,null,null,null,null,null,null,null,null,null,null,"contre",null,null,null,null,null,null,null,null,null,null,"contre"]
[null,null,{"$f":"IF(D145<>\"\",'GROUPE A'!$K$21,\"\")","v":6},null,null," ",null,null,null,null,null,null,null,{"$f":"IF(O145<>\"\",'GROUPE A'!$K$22,\"\")","v":7},null,null," ",null,null,null,null,null,null,null,null,{"$f":"IF(AA145<>\"\",'GROUPE B'!$K$21,\"\")","v":12},null,null," ",null,null,null,null,null,null,null,{"$f":"IF(AL145<>\"\",'GROUPE B'!$K$22,\"\")","v":15},null,null," "]
[null,null,{"$f":"IF(C151<>\"\",VLOOKUP(C151,Liste!$C$17:$I$24,3,FALSE),\"\")","v":"PIERROT Tristan"},null,null,null,null,null,null,null,null,null,null,{"$f":"IF(N151<>\"\",VLOOKUP(N151,Liste!$C$17:$I$24,3,FALSE),\"\")","v":"FILLOU Marie-Christine"},null,null,null,null,null,null,null,null,null,null,null,{"$f":"IF(Z151<>\"\",VLOOKUP(Z151,Liste!$C$30:$I$37,3,FALSE),\"\")","v":"SIREAU GOSSIAUX Florence"},null,null,null,null,null,null,null,null,null,null,{"$f":"IF(AK151<>\"\",VLOOKUP(AK151,Liste!$C$30:$I$37,3,FALSE),\"\")","v":"DUBOIS Gilles"}]
[null,null,{"$f":"IF(C151<>\"\",VLOOKUP(C151,Liste!$C$17:$I$24,7,FALSE),\"\")","v":"TT JOUE LES TOURS"},null,null,null,null,null,null,null,null,null,null,{"$f":"IF(N151<>\"\",VLOOKUP(N151,Liste!$C$17:$I$24,7,FALSE),\"\")","v":"SAINT-AVERTIN STT"},null,null,null,null,null,null,null,null,null,null,null,{"$f":"IF(Z151<>\"\",VLOOKUP(Z151,Liste!$C$30:$I$37,7,FALSE),\"\")","v":"A. VOISINS TT"},null,null,null,null,null,null,null,null,null,null,{"$f":"IF(AK151<>\"\",VLOOKUP(AK151,Liste!$C$30:$I$37,7,FALSE),\"\")","v":"LE MANS SARTHE TT"}]
[]
[]
[]
[null,null,"CARTONS",null,null,"J","J+R 1","J+R 2",null,null,null,null,null,"CARTONS",null,null,"J","J+R 1","J+R 2",null,null,null,null,null,null,"CARTONS",null,null,"J","J+R 1","J+R 2",null,null,null,null,null,"CARTONS",null,null,"J","J+R 1","J+R 2"]
[null,null,{"$f":"C147","v":"RUTLER Sébastien"},null,null,null,null,null,null,null,null,null,null,{"$f":"N147","v":"MANIER William"},null,null,null,null,null,null,null,null,null,null,null,{"$f":"Z147","v":"PAPIRER Alan"},null,null,null,null,null,null,null,null,null,null,{"$f":"AK147","v":"BELTRAND Arnaud"}]
[]
[null,null,{"$f":"C152","v":"PIERROT Tristan"},null,null,null,null,null,null,null,null,null,null,{"$f":"N152","v":"FILLOU Marie-Christine"},null,null,null,null,null,null,null,null,null,null,null,{"$f":"Z152","v":"SIREAU GOSSIAUX Florence"},null,null,null,null,null,null,null,null,null,null,{"$f":"AK152","v":"DUBOIS Gilles"}]
[]
[null,null,"Signature de l' Arbitre :",null,null,null,null,null,null,null,null,null,null,"Signature de l' Arbitre :",null,null,null,null,null,null,null,null,null,null,null,"Signature de l' Arbitre :",null,null,null,null,null,null,null,null,null,null,"Signature de l' Arbitre :"]
[]
[null,null,"Sitôt la partie terminée ; rapporter cette fiche à la table du Juge Arbitre;",null,null,null,null,null,null,null,null,null,null,"Sitôt la partie terminée ; rapporter cette fiche à la table du Juge Arbitre;",null,null,null,null,null,null,null,null,null,null,null,"Sitôt la partie terminée ; rapporter cette fiche à la table du Juge Arbitre;",null,null,null,null,null,null,null,null,null,null,"Sitôt la partie terminée ; rapporter cette fiche à la table du Juge Arbitre;"]
[]
[]
[null,null,{"$f":"IF(Prépa!$O$10<>0,Prépa!$O$10,\"\")","v":"Critérium Fédéral"},null,null,null,null,null,null,null,null,null,null,{"$f":"IF(Prépa!$O$10<>0,Prépa!$O$10,\"\")","v":"Critérium Fédéral"},null,null,null,null,null,null,null,null,null,null,null,{"$f":"IF(Prépa!$O$10<>0,Prépa!$O$10,\"\")","v":"Critérium Fédéral"},null,null,null,null,null,null,null,null,null,null,{"$f":"IF(Prépa!$O$10<>0,Prépa!$O$10,\"\")","v":"Critérium Fédéral"}]
[null,null,{"$f":"IF(Prépa!$D$14<>0,Prépa!$D$14,\"\")&IF(Prépa!$K$110<>0,\" - \"&Prépa!$K$110,\"\")","v":"TOURS - 10 Fevrier 2018"},null,null,null,null,null,null,null,null,null,null,{"$f":"IF(Prépa!$D$14<>0,Prépa!$D$14,\"\")&IF(Prépa!$K$110<>0,\" - \"&Prépa!$K$110,\"\")","v":"TOURS - 10 Fevrier 2018"},null,null,null,null,null,null,null,null,null,null,null,{"$f":"IF(Prépa!$D$14<>0,Prépa!$D$14,\"\")&IF(Prépa!$K$110<>0,\" - \"&Prépa!$K$110,\"\")","v":"TOURS - 10 Fevrier 2018"},null,null,null,null,null,null,null,null,null,null,{"$f":"IF(Prépa!$D$14<>0,Prépa!$D$14,\"\")&IF(Prépa!$K$110<>0,\" - \"&Prépa!$K$110,\"\")","v":"TOURS - 10 Fevrier 2018"}]
[]
[null,null,{"$f":"IF(Prépa!$O$72<>\"\",Prépa!$O$72,\"\")&IF(Prépa!$O$29<>\"\",\" - \"&Prépa!$O$29,\"\")","v":"OPEN Assis - Nat 2A Nord"},null,null,null,null,null,null,null,null,null,null,{"$f":"IF(Prépa!$O$72<>\"\",Prépa!$O$72,\"\")&IF(Prépa!$O$29<>\"\",\" - \"&Prépa!$O$29,\"\")","v":"OPEN Assis - Nat 2A Nord"},null,null,null,null,null,null,null,null,null,null,null,{"$f":"IF(Prépa!$O$72<>\"\",Prépa!$O$72,\"\")&IF(Prépa!$O$32<>\"\",\" - \"&Prépa!$O$32,\"\")","v":"OPEN Assis - Nat 2B Nord"},null,null,null,null,null,null,null,null,null,null,{"$f":"IF(Prépa!$O$72<>\"\",Prépa!$O$72,\"\")&IF(Prépa!$O$32<>\"\",\" - \"&Prépa!$O$32,\"\")","v":"OPEN Assis - Nat 2B Nord"}]
[]
[null,null,null,null,"Heure :",{"$f":"IF(Prépa!$W$22<>\"\",Prépa!$W$22,\"\")","v":"11h30"},null,null,"Table :",{"$f":"IF(Prépa!$X$22<>\"\",Prépa!$X$22,\"\")","v":4},null,null,null,null,null,"Heure :",{"$f":"IF(Prépa!$W$23<>\"\",Prépa!$W$23,\"\")","v":"11h30"},null,null,"Table :",{"$f":"IF(Prépa!$X$23<>\"\",Prépa!$X$23,\"\")","v":1},null,null,null,null,null,null,"Heure :",{"$f":"IF(Prépa!$AD$22<>\"\",Prépa!$AD$22,\"\")","v":"11h30"},null,null,"Table :",{"$f":"IF(Prépa!$AE$22<>\"\",Prépa!$AE$22,\"\")","v":8},null,null,null,null,null,"Heure :",{"$f":"IF(Prépa!$AD$23<>\"\",Prépa!$AD$23,\"\")","v":"11h30"},null,null,"Table :",{"$f":"IF(Prépa!$AE$23<>\"\",Prépa!$AE$23,\"\")","v":5}]
[]
[null,null,"Arbitre : ",null,null,null,null,null,null,null,null,null,null,"Arbitre : ",null,null,null,null,null,null,null,null,null,null,null,"Arbitre : ",null,null,null,null,null,null,null,null,null,null,"Arbitre : "]
[null,null,null,null,null,null,"11ème Partie",null,null,null,null,null,null,null,null,null,null,"12ème Partie",null,null,null,null,null,null,null,null,null,null,null,"11ème Partie",null,null,null,null,null,null,null,null,null,null,"12ème Partie"]
[null,null,null,null,null,"MANCHES",null,null,null,null,null,null,null,null,null,null,"MANCHES",null,null,null,null,null,null,null,null,null,null,null,"MANCHES",null,null,null,null,null,null,null,null,null,null,"MANCHES"]
[null,null,"PARTIE",null,null,1,2,3,4,5,6,7,null,"PARTIE",null,null,1,2,3,4,5,6,7,null,null,"PARTIE",null,null,1,2,3,4,5,6,7,null,"PARTIE",null,null,1,2,3,4,5,6,7]
[null,null,null,{"$f":"IF(AND('GROUPE A'!$C$37<>\"\",'GROUPE A'!$E$37<>\"\"),'GROUPE A'!$C$37&\" - \"&'GROUPE A'!$E$37,\"\")","v":"4 - 8"},null,"Premier service : GAUCHE - DROITE",null,null,null,null,null,null,null,null,{"$f":"IF(AND('GROUPE A'!$C$38<>\"\",'GROUPE A'!$E$38<>\"\"),'GROUPE A'!$C$38&\" - \"&'GROUPE A'!$E$38,\"\")","v":"2 - 3"},null,"Premier service : GAUCHE - DROITE",null,null,null,null,null,null,null,null,null,{"$f":"IF(AND('GROUPE B'!$C$37<>\"\",'GROUPE B'!$E$37<>\"\"),'GROUPE B'!$C$37&\" - \"&'GROUPE B'!$E$37,\"\")","v":"4 - 8"},null,"Premier service : GAUCHE - DROITE",null,null,null,null,null,null,null,null,{"$f":"IF(AND('GROUPE B'!$C$38<>\"\",'GROUPE B'!$E$38<>\"\"),'GROUPE B'!$C$38&\" - \"&'GROUPE B'!$E$38,\"\")","v":"2 - 3"},null,"Premier service : GAUCHE - DROITE"]
[null,null,{"$f":"IF(D178<>\"\",'GROUPE A'!$K$19,\"\")","v":4},null,null,null,null,null,null,null,null,null,null,{"$f":"IF(O178<>\"\",'GROUPE A'!$K$17,\"\")","v":2},null,null,null,null,null,null,null,null,null,null,null,{"$f":"IF(AA178<>\"\",'GROUPE B'!$K$19,\"\")","v":13},null,null,null,null,null,null,null,null,null,null,{"$f":"IF(AL178<>\"\",'GROUPE B'!$K$17,\"\")","v":16}]
[null,null,{"$f":"IF(C179<>\"\",VLOOKUP(C179,Liste!$C$17:$I$24,3,FALSE),\"\")","v":"DEFRENEIX Samuel"},null,null,null,null,null,null,null,null,null,null,{"$f":"IF(N179<>\"\",VLOOKUP(N179,Liste!$C$17:$I$24,3,FALSE),\"\")","v":"LE MOAL Bruno"},null,null,null,null,null,null,null,null,null,null,null,{"$f":"IF(Z179<>\"\",VLOOKUP(Z179,Liste!$C$30:$I$37,3,FALSE),\"\")","v":"KERGOSIEN Arnaud"},null,null,null,null,null,null,null,null,null,null,{"$f":"IF(AK179<>\"\",VLOOKUP(AK179,Liste!$C$30:$I$37,3,FALSE),\"\")","v":"HENOUX Frédéric"}]
[null,null,{"$f":"IF(C179<>\"\",VLOOKUP(C179,Liste!$C$17:$I$24,7,FALSE),\"\")","v":"CTT DEOLS"},null,null,null,null,null,null,null,null,null,null,{"$f":"IF(N179<>\"\",VLOOKUP(N179,Liste!$C$17:$I$24,7,FALSE),\"\")","v":"F.O.L.C.L.O."},null,null,null,null,null,null,null,null,null,null,null,{"$f":"IF(Z179<>\"\",VLOOKUP(Z179,Liste!$C$30:$I$37,7,FALSE),\"\")","v":"F.O.L.C.L.O."},null,null,null,null,null,null,null,null,null,null,{"$f":"IF(AK179<>\"\",VLOOKUP(AK179,Liste!$C$30:$I$37,7,FALSE),\"\")","v":"CTT CHATEAU THIERRY"}]
[]
[null,null,null,"contre",null,null,null,null,null,null,null,null,null,null,"contre",null,null,null,null,null,null,null,null,null,null,null,"contre",null,null,null,null,null,null,null,null,null,null,"contre"]
[null,null,{"$f":"IF(D178<>\"\",'GROUPE A'!$K$23,\"\")","v":8},null,null," ",null,null,null,null,null,null,null,{"$f":"IF(O178<>\"\",'GROUPE A'!$K$18,\"\")","v":3},null,null," ",null,null,null,null,null,null,null,null,{"$f":"IF(AA178<>\"\",'GROUPE B'!$K$23,\"\")","v":10},null,null," ",null,null,null,null,null,null,null,{"$f":"IF(AL178<>\"\",'GROUPE B'!$K$18,\"\")","v":11},null,null," "]
[null,null,{"$f":"IF(C184<>\"\",VLOOKUP(C184,Liste!$C$17:$I$24,3,FALSE),\"\")","v":"GOLLNISCH Laurent"},null,null,null,null,null,null,null,null,null,null,{"$f":"IF(N184<>\"\",VLOOKUP(N184,Liste!$C$17:$I$24,3,FALSE),\"\")","v":"PLET Victorien"},null,null,null,null,null,null,null,null,null,null,null,{"$f":"IF(Z184<>\"\",VLOOKUP(Z184,Liste!$C$30:$I$37,3,FALSE),\"\")","v":"HASLE Stéphane"},null,null,null,null,null,null,null,null,null,null,{"$f":"IF(AK184<>\"\",VLOOKUP(AK184,Liste!$C$30:$I$37,3,FALSE),\"\")","v":"ADJAL Yorick"}]
[null,null,{"$f":"IF(C184<>\"\",VLOOKUP(C184,Liste!$C$17:$I$24,7,FALSE),\"\")","v":"MOULINS LES METZ HANDISPORT"},null,null,null,null,null,null,null,null,null,null,{"$f":"IF(N184<>\"\",VLOOKUP(N184,Liste!$C$17:$I$24,7,FALSE),\"\")","v":"US SAINT BERTHEVIN/SAINT LOUP"},null,null,null,null,null,null,null,null,null,null,null,{"$f":"IF(Z184<>\"\",VLOOKUP(Z184,Liste!$C$30:$I$37,7,FALSE),\"\")","v":"THORIGNE-FOUILLARD TT"},null,null,null,null,null,null,null,null,null,null,{"$f":"IF(AK184<>\"\",VLOOKUP(AK184,Liste!$C$30:$I$37,7,FALSE),\"\")","v":"A. VOISINS TT"}]
[]
[]
[]
[null,null,"CARTONS",null,null,"J","J+R 1","J+R 2",null,null,null,null,null,"CARTONS",null,null,"J","J+R 1","J+R 2",null,null,null,null,null,null,"CARTONS",null,null,"J","J+R 1","J+R 2",null,null,null,null,null,"CARTONS",null,null,"J","J+R 1","J+R 2"]
[null,null,{"$f":"C180","v":"DEFRENEIX Samuel"},null,null,null,null,null,null,null,null,null,null,{"$f":"N180","v":"LE MOAL Bruno"},null,null,null,null,null,null,null,null,null,null,null,{"$f":"Z180","v":"KERGOSIEN Arnaud"},null,null,null,null,null,null,null,null,null,null,{"$f":"AK180","v":"HENOUX Frédéric"}]
[]
[null,null,{"$f":"C185","v":"GOLLNISCH Laurent"},null,null,null,null,null,null,null,null,null,null,{"$f":"N185","v":"PLET Victorien"},null,null,null,null,null,null,null,null,null,null,null,{"$f":"Z185","v":"HASLE Stéphane"},null,null,null,null,null,null,null,null,null,null,{"$f":"AK185","v":"ADJAL Yorick"}]
[]
[null,null,"Signature de l' Arbitre :",null,null,null,null,null,null,null,null,null,null,"Signature de l' Arbitre :",null,null,null,null,null,null,null,null,null,null,null,"Signature de l' Arbitre :",null,null,null,null,null,null,null,null,null,null,"Signature de l' Arbitre :"]
[]
[null,null,"Sitôt la partie terminée ; rapporter cette fiche à la table du Juge Arbitre;",null,null,null,null,null,null,null,null,null,null,"Sitôt la partie terminée ; rapporter cette fiche à la table du Juge Arbitre;",null,null,null,null,null,null,null,null,null,null,null,"Sitôt la partie terminée ; rapporter cette fiche à la table du Juge Arbitre;",null,null,null,null,null,null,null,null,null,null,"Sitôt la partie terminée ; rapporter cette fiche à la table du Juge Arbitre;"]
[]
[]
[null,null,{"$f":"IF(Prépa!$O$10<>0,Prépa!$O$10,\"\")","v":"Critérium Fédéral"},null,null,null,null,null,null,null,null,null,null,{"$f":"IF(Prépa!$O$10<>0,Prépa!$O$10,\"\")","v":"Critérium Fédéral"},null,null,null,null,null,null,null,null,null,null,null,{"$f":"IF(Prépa!$O$10<>0,Prépa!$O$10,\"\")","v":"Critérium Fédéral"},null,null,null,null,null,null,null,null,null,null,{"$f":"IF(Prépa!$O$10<>0,Prépa!$O$10,\"\")","v":"Critérium Fédéral"}]
[null,null,{"$f":"IF(Prépa!$D$14<>0,Prépa!$D$14,\"\")&IF(Prépa!$K$110<>0,\" - \"&Prépa!$K$110,\"\")","v":"TOURS - 10 Fevrier 2018"},null,null,null,null,null,null,null,null,null,null,{"$f":"IF(Prépa!$D$14<>0,Prépa!$D$14,\"\")&IF(Prépa!$K$110<>0,\" - \"&Prépa!$K$110,\"\")","v":"TOURS - 10 Fevrier 2018"},null,null,null,null,null,null,null,null,null,null,null,{"$f":"IF(Prépa!$D$14<>0,Prépa!$D$14,\"\")&IF(Prépa!$K$110<>0,\" - \"&Prépa!$K$110,\"\")","v":"TOURS - 10 Fevrier 2018"},null,null,null,null,null,null,null,null,null,null,{"$f":"IF(Prépa!$D$14<>0,Prépa!$D$14,\"\")&IF(Prépa!$K$110<>0,\" - \"&Prépa!$K$110,\"\")","v":"TOURS - 10 Fevrier 2018"}]
[]
[null,null,{"$f":"IF(Prépa!$O$72<>\"\",Prépa!$O$72,\"\")&IF(Prépa!$O$29<>\"\",\" - \"&Prépa!$O$29,\"\")","v":"OPEN Assis - Nat 2A Nord"},null,null,null,null,null,null,null,null,null,null,{"$f":"IF(Prépa!$O$72<>\"\",Prépa!$O$72,\"\")&IF(Prépa!$O$29<>\"\",\" - \"&Prépa!$O$29,\"\")","v":"OPEN Assis - Nat 2A Nord"},null,null,null,null,null,null,null,null,null,null,null,{"$f":"IF(Prépa!$O$72<>\"\",Prépa!$O$72,\"\")&IF(Prépa!$O$32<>\"\",\" - \"&Prépa!$O$32,\"\")","v":"OPEN Assis - Nat 2B Nord"},null,null,null,null,null,null,null,null,null,null,{"$f":"IF(Prépa!$O$72<>\"\",Prépa!$O$72,\"\")&IF(Prépa!$O$32<>\"\",\" - \"&Prépa!$O$32,\"\")","v":"OPEN Assis - Nat 2B Nord"}]
[]
[null,null,null,null,"Heure :",{"$f":"IF(Prépa!$W$27<>\"\",Prépa!$W$27,\"\")","v":"13h30"},null,null,"Table :",{"$f":"IF(Prépa!$X$27<>\"\",Prépa!$X$27,\"\")","v":6},null,null,null,null,null,"Heure :",{"$f":"IF(Prépa!$W$28<>\"\",Prépa!$W$28,\"\")","v":"13h30"},null,null,"Table :",{"$f":"IF(Prépa!$X$28<>\"\",Prépa!$X$28,\"\")","v":7},null,null,null,null,null,null,"Heure :",{"$f":"IF(Prépa!$AD$27<>\"\",Prépa!$AD$27,\"\")","v":"13h30"},null,null,"Table :",{"$f":"IF(Prépa!$AE$27<>\"\",Prépa!$AE$27,\"\")","v":2},null,null,null,null,null,"Heure :",{"$f":"IF(Prépa!$AD$28<>\"\",Prépa!$AD$28,\"\")","v":"13h30"},null,null,"Table :",{"$f":"IF(Prépa!$AE$28<>\"\",Prépa!$AE$28,\"\")","v":3}]
[]
[null,null,"Arbitre : ",null,null,null,null,null,null,null,null,null,null,"Arbitre : ",null,null,null,null,null,null,null,null,null,null,null,"Arbitre : ",null,null,null,null,null,null,null,null,null,null,"Arbitre : "]
[null,null,null,null,null,null,"13ème Partie",null,null,null,null,null,null,null,null,null,null,"14ème Partie",null,null,null,null,null,null,null,null,null,null,null,"13ème Partie",null,null,null,null,null,null,null,null,null,null,"14ème Partie"]
[null,null,null,null,null,"MANCHES",null,null,null,null,null,null,null,null,null,null,"MANCHES",null,null,null,null,null,null,null,null,null,null,null,"MANCHES",null,null,null,null,null,null,null,null,null,null,"MANCHES"]
[null,null,"PARTIE",null,null,1,2,3,4,5,6,7,null,"PARTIE",null,null,1,2,3,4,5,6,7,null,null,"PARTIE",null,null,1,2,3,4,5,6,7,null,"PARTIE",null,null,1,2,3,4,5,6,7]
[null,null,null,{"$f":"IF(AND('GROUPE A'!$C$39<>\"\",'GROUPE A'!$E$39<>\"\"),'GROUPE A'!$C$39&\" - \"&'GROUPE A'!$E$39,\"\")","v":"1 - 5"},null,"Premier service : GAUCHE - DROITE",null,null,null,null,null,null,null,null,{"$f":"IF(AND('GROUPE A'!$C$40<>\"\",'GROUPE A'!$E$40<>\"\"),'GROUPE A'!$C$40&\" - \"&'GROUPE A'!$E$40,\"\")","v":"4 - 6"},null,"Premier service : GAUCHE - DROITE",null,null,null,null,null,null,null,null,null,{"$f":"IF(AND('GROUPE B'!$C$39<>\"\",'GROUPE B'!$E$39<>\"\"),'GROUPE B'!$C$39&\" - \"&'GROUPE B'!$E$39,\"\")","v":"1 - 5"},null,"Premier service : GAUCHE - DROITE",null,null,null,null,null,null,null,null,{"$f":"IF(AND('GROUPE B'!$C$40<>\"\",'GROUPE B'!$E$40<>\"\"),'GROUPE B'!$C$40&\" - \"&'GROUPE B'!$E$40,\"\")","v":"4 - 6"},null,"Premier service : GAUCHE - DROITE"]
[null,null,{"$f":"IF(D211<>\"\",'GROUPE A'!$K$16,\"\")","v":1},null,null,null,null,null,null,null,null,null,null,{"$f":"IF(O211<>\"\",'GROUPE A'!$K$19,\"\")","v":4},null,null,null,null,null,null,null,null,null,null,null,{"$f":"IF(AA211<>\"\",'GROUPE B'!$K$16,\"\")","v":9},null,null,null,null,null,null,null,null,null,null,{"$f":"IF(AL211<>\"\",'GROUPE B'!$K$19,\"\")","v":13}]
[null,null,{"$f":"IF(C212<>\"\",VLOOKUP(C212,Liste!$C$17:$I$24,3,FALSE),\"\")","v":"RUTLER Sébastien"},null,null,null,null,null,null,null,null,null,null,{"$f":"IF(N212<>\"\",VLOOKUP(N212,Liste!$C$17:$I$24,3,FALSE),\"\")","v":"DEFRENEIX Samuel"},null,null,null,null,null,null,null,null,null,null,null,{"$f":"IF(Z212<>\"\",VLOOKUP(Z212,Liste!$C$30:$I$37,3,FALSE),\"\")","v":"PAPIRER Alan"},null,null,null,null,null,null,null,null,null,null,{"$f":"IF(AK212<>\"\",VLOOKUP(AK212,Liste!$C$30:$I$37,3,FALSE),\"\")","v":"KERGOSIEN Arnaud"}]
[null,null,{"$f":"IF(C212<>\"\",VLOOKUP(C212,Liste!$C$17:$I$24,7,FALSE),\"\")","v":"PPN NEUVILLE EN FERRAIN"},null,null,null,null,null,null,null,null,null,null,{"$f":"IF(N212<>\"\",VLOOKUP(N212,Liste!$C$17:$I$24,7,FALSE),\"\")","v":"CTT DEOLS"},null,null,null,null,null,null,null,null,null,null,null,{"$f":"IF(Z212<>\"\",VLOOKUP(Z212,Liste!$C$30:$I$37,7,FALSE),\"\")","v":"MOULINS LES METZ HANDISPORT"},null,null,null,null,null,null,null,null,null,null,{"$f":"IF(AK212<>\"\",VLOOKUP(AK212,Liste!$C$30:$I$37,7,FALSE),\"\")","v":"F.O.L.C.L.O."}]
[]
[null,null,null,"contre",null,null,null,null,null,null,null,null,null,null,"contre",null,null,null,null,null,null,null,null,null,null,null,"contre",null,null,null,null,null,null,null,null,null,null,"contre"]
[null,null,{"$f":"IF(D211<>\"\",'GROUPE A'!$K$20,\"\")","v":5},null,null," ",null,null,null,null,null,null,null,{"$f":"IF(O211<>\"\",'GROUPE A'!$K$21,\"\")","v":6},null,null," ",null,null,null,null,null,null,null,null,{"$f":"IF(AA211<>\"\",'GROUPE B'!$K$20,\"\")","v":14},null,null," ",null,null,null,null,null,null,null,{"$f":"IF(AL211<>\"\",'GROUPE B'!$K$21,\"\")","v":12},null,null," "]
[null,null,{"$f":"IF(C217<>\"\",VLOOKUP(C217,Liste!$C$17:$I$24,3,FALSE),\"\")","v":"MANIER William"},null,null,null,null,null,null,null,null,null,null,{"$f":"IF(N217<>\"\",VLOOKUP(N217,Liste!$C$17:$I$24,3,FALSE),\"\")","v":"PIERROT Tristan"},null,null,null,null,null,null,null,null,null,null,null,{"$f":"IF(Z217<>\"\",VLOOKUP(Z217,Liste!$C$30:$I$37,3,FALSE),\"\")","v":"BELTRAND Arnaud"},null,null,null,null,null,null,null,null,null,null,{"$f":"IF(AK217<>\"\",VLOOKUP(AK217,Liste!$C$30:$I$37,3,FALSE),\"\")","v":"SIREAU GOSSIAUX Florence"}]
[null,null,{"$f":"IF(C217<>\"\",VLOOKUP(C217,Liste!$C$17:$I$24,7,FALSE),\"\")","v":"CGL SUD OISE TT"},null,null,null,null,null,null,null,null,null,null,{"$f":"IF(N217<>\"\",VLOOKUP(N217,Liste!$C$17:$I$24,7,FALSE),\"\")","v":"TT JOUE LES TOURS"},null,null,null,null,null,null,null,null,null,null,null,{"$f":"IF(Z217<>\"\",VLOOKUP(Z217,Liste!$C$30:$I$37,7,FALSE),\"\")","v":"TT JOUE LES TOURS"},null,null,null,null,null,null,null,null,null,null,{"$f":"IF(AK217<>\"\",VLOOKUP(AK217,Liste!$C$30:$I$37,7,FALSE),\"\")","v":"A. VOISINS TT"}]
[]
[]
[]
[null,null,"CARTONS",null,null,"J","J+R 1","J+R 2",null,null,null,null,null,"CARTONS",null,null,"J","J+R 1","J+R 2",null,null,null,null,null,null,"CARTONS",null,null,"J","J+R 1","J+R 2",null,null,null,null,null,"CARTONS",null,null,"J","J+R 1","J+R 2"]
[null,null,{"$f":"C213","v":"RUTLER Sébastien"},null,null,null,null,null,null,null,null,null,null,{"$f":"N213","v":"DEFRENEIX Samuel"},null,null,null,null,null,null,null,null,null,null,null,{"$f":"Z213","v":"PAPIRER Alan"},null,null,null,null,null,null,null,null,null,null,{"$f":"AK213","v":"KERGOSIEN Arnaud"}]
[]
[null,null,{"$f":"C218","v":"MANIER William"},null,null,null,null,null,null,null,null,null,null,{"$f":"N218","v":"PIERROT Tristan"},null,null,null,null,null,null,null,null,null,null,null,{"$f":"Z218","v":"BELTRAND Arnaud"},null,null,null,null,null,null,null,null,null,null,{"$f":"AK218","v":"SIREAU GOSSIAUX Florence"}]
[]
[null,null,"Signature de l' Arbitre :",null,null,null,null,null,null,null,null,null,null,"Signature de l' Arbitre :",null,null,null,null,null,null,null,null,null,null,null,"Signature de l' Arbitre :",null,null,null,null,null,null,null,null,null,null,"Signature de l' Arbitre :"]
[]
[null,null,"Sitôt la partie terminée ; rapporter cette fiche à la table du Juge Arbitre;",null,null,null,null,null,null,null,null,null,null,"Sitôt la partie terminée ; rapporter cette fiche à la table du Juge Arbitre;",null,null,null,null,null,null,null,null,null,null,null,"Sitôt la partie terminée ; rapporter cette fiche à la table du Juge Arbitre;",null,null,null,null,null,null,null,null,null,null,"Sitôt la partie terminée ; rapporter cette fiche à la table du Juge Arbitre;"]
[]
[]
[null,null,{"$f":"IF(Prépa!$O$10<>0,Prépa!$O$10,\"\")","v":"Critérium Fédéral"},null,null,null,null,null,null,null,null,null,null,{"$f":"IF(Prépa!$O$10<>0,Prépa!$O$10,\"\")","v":"Critérium Fédéral"},null,null,null,null,null,null,null,null,null,null,null,{"$f":"IF(Prépa!$O$10<>0,Prépa!$O$10,\"\")","v":"Critérium Fédéral"},null,null,null,null,null,null,null,null,null,null,{"$f":"IF(Prépa!$O$10<>0,Prépa!$O$10,\"\")","v":"Critérium Fédéral"}]
[null,null,{"$f":"IF(Prépa!$D$14<>0,Prépa!$D$14,\"\")&IF(Prépa!$K$110<>0,\" - \"&Prépa!$K$110,\"\")","v":"TOURS - 10 Fevrier 2018"},null,null,null,null,null,null,null,null,null,null,{"$f":"IF(Prépa!$D$14<>0,Prépa!$D$14,\"\")&IF(Prépa!$K$110<>0,\" - \"&Prépa!$K$110,\"\")","v":"TOURS - 10 Fevrier 2018"},null,null,null,null,null,null,null,null,null,null,null,{"$f":"IF(Prépa!$D$14<>0,Prépa!$D$14,\"\")&IF(Prépa!$K$110<>0,\" - \"&Prépa!$K$110,\"\")","v":"TOURS - 10 Fevrier 2018"},null,null,null,null,null,null,null,null,null,null,{"$f":"IF(Prépa!$D$14<>0,Prépa!$D$14,\"\")&IF(Prépa!$K$110<>0,\" - \"&Prépa!$K$110,\"\")","v":"TOURS - 10 Fevrier 2018"}]
[]
[null,null,{"$f":"IF(Prépa!$O$72<>\"\",Prépa!$O$72,\"\")&IF(Prépa!$O$29<>\"\",\" - \"&Prépa!$O$29,\"\")","v":"OPEN Assis - Nat 2A Nord"},null,null,null,null,null,null,null,null,null,null,{"$f":"IF(Prépa!$O$72<>\"\",Prépa!$O$72,\"\")&IF(Prépa!$O$29<>\"\",\" - \"&Prépa!$O$29,\"\")","v":"OPEN Assis - Nat 2A Nord"},null,null,null,null,null,null,null,null,null,null,null,{"$f":"IF(Prépa!$O$72<>\"\",Prépa!$O$72,\"\")&IF(Prépa!$O$32<>\"\",\" - \"&Prépa!$O$32,\"\")","v":"OPEN Assis - Nat 2B Nord"},null,null,null,null,null,null,null,null,null,null,{"$f":"IF(Prépa!$O$72<>\"\",Prépa!$O$72,\"\")&IF(Prépa!$O$32<>\"\",\" - \"&Prépa!$O$32,\"\")","v":"OPEN Assis - Nat 2B Nord"}]
[]
[null,null,null,null,"Heure :",{"$f":"IF(Prépa!$W$29<>\"\",Prépa!$W$29,\"\")","v":"13h30"},null,null,"Table :",{"$f":"IF(Prépa!$X$29<>\"\",Prépa!$X$29,\"\")","v":8},null,null,null,null,null,"Heure :",{"$f":"IF(Prépa!$W$30<>\"\",Prépa!$W$30,\"\")","v":"13h30"},null,null,"Table :",{"$f":"IF(Prépa!$X$30<>\"\",Prépa!$X$30,\"\")","v":5},null,null,null,null,null,null,"Heure :",{"$f":"IF(Prépa!$AD$29<>\"\",Prépa!$AD$29,\"\")","v":"13h30"},null,null,"Table :",{"$f":"IF(Prépa!$AE$29<>\"\",Prépa!$AE$29,\"\")","v":4},null,null,null,null,null,"Heure :",{"$f":"IF(Prépa!$AD$30<>\"\",Prépa!$AD$30,\"\")","v":"13h30"},null,null,"Table :",{"$f":"IF(Prépa!$AE$30<>\"\",Prépa!$AE$30,\"\")","v":1}]
[]
[null,null,"Arbitre : ",null,null,null,null,null,null,null,null,null,null,"Arbitre : ",null,null,null,null,null,null,null,null,null,null,null,"Arbitre : ",null,null,null,null,null,null,null,null,null,null,"Arbitre : "]
[null,null,null,null,null,null,"15ème Partie",null,null,null,null,null,null,null,null,null,null,"16ème Partie",null,null,null,null,null,null,null,null,null,null,null,"15ème Partie",null,null,null,null,null,null,null,null,null,null,"16ème Partie"]
[null,null,null,null,null,"MANCHES",null,null,null,null,null,null,null,null,null,null,"MANCHES",null,null,null,null,null,null,null,null,null,null,null,"MANCHES",null,null,null,null,null,null,null,null,null,null,"MANCHES"]
[null,null,"PARTIE",null,null,1,2,3,4,5,6,7,null,"PARTIE",null,null,1,2,3,4,5,6,7,null,null,"PARTIE",null,null,1,2,3,4,5,6,7,null,"PARTIE",null,null,1,2,3,4,5,6,7]
[null,null,null,{"$f":"IF(AND('GROUPE A'!$C$41<>\"\",'GROUPE A'!$E$41<>\"\"),'GROUPE A'!$C$41&\" - \"&'GROUPE A'!$E$41,\"\")","v":"3 - 7"},null,"Premier service : GAUCHE - DROITE",null,null,null,null,null,null,null,null,{"$f":"IF(AND('GROUPE A'!$C$42<>\"\",'GROUPE A'!$E$42<>\"\"),'GROUPE A'!$C$42&\" - \"&'GROUPE A'!$E$42,\"\")","v":"2 - 8"},null,"Premier service : GAUCHE - DROITE",null,null,null,null,null,null,null,null,null,{"$f":"IF(AND('GROUPE B'!$C$41<>\"\",'GROUPE B'!$E$41<>\"\"),'GROUPE B'!$C$41&\" - \"&'GROUPE B'!$E$41,\"\")","v":"3 - 7"},null,"Premier service : GAUCHE - DROITE",null,null,null,null,null,null,null,null,{"$f":"IF(AND('GROUPE B'!$C$42<>\"\",'GROUPE B'!$E$42<>\"\"),'GROUPE B'!$C$42&\" - \"&'GROUPE B'!$E$42,\"\")","v":"2 - 8"},null,"Premier service : GAUCHE - DROITE"]
[null,null,{"$f":"IF(D244<>\"\",'GROUPE A'!$K$18,\"\")","v":3},null,null,null,null,null,null,null,null,null,null,{"$f":"IF(O244<>\"\",'GROUPE A'!$K$17,\"\")","v":2},null,null,null,null,null,null,null,null,null,null,null,{"$f":"IF(AA244<>\"\",'GROUPE B'!$K$18,\"\")","v":11},null,null,null,null,null,null,null,null,null,null,{"$f":"IF(AL244<>\"\",'GROUPE B'!$K$17,\"\")","v":16}]
[null,null,{"$f":"IF(C245<>\"\",VLOOKUP(C245,Liste!$C$17:$I$24,3,FALSE),\"\")","v":"PLET Victorien"},null,null,null,null,null,null,null,null,null,null,{"$f":"IF(N245<>\"\",VLOOKUP(N245,Liste!$C$17:$I$24,3,FALSE),\"\")","v":"LE MOAL Bruno"},null,null,null,null,null,null,null,null,null,null,null,{"$f":"IF(Z245<>\"\",VLOOKUP(Z245,Liste!$C$30:$I$37,3,FALSE),\"\")","v":"ADJAL Yorick"},null,null,null,null,null,null,null,null,null,null,{"$f":"IF(AK245<>\"\",VLOOKUP(AK245,Liste!$C$30:$I$37,3,FALSE),\"\")","v":"HENOUX Frédéric"}]
[null,null,{"$f":"IF(C245<>\"\",VLOOKUP(C245,Liste!$C$17:$I$24,7,FALSE),\"\")","v":"US SAINT BERTHEVIN/SAINT LOUP"},null,null,null,null,null,null,null,null,null,null,{"$f":"IF(N245<>\"\",VLOOKUP(N245,Liste!$C$17:$I$24,7,FALSE),\"\")","v":"F.O.L.C.L.O."},null,null,null,null,null,null,null,null,null,null,null,{"$f":"IF(Z245<>\"\",VLOOKUP(Z245,Liste!$C$30:$I$37,7,FALSE),\"\")","v":"A. VOISINS TT"},null,null,null,null,null,null,null,null,null,null,{"$f":"IF(AK245<>\"\",VLOOKUP(AK245,Liste!$C$30:$I$37,7,FALSE),\"\")","v":"CTT CHATEAU THIERRY"}]
[]
[null,null,null,"contre",null,null,null,null,null,null,null,null,null,null,"contre",null,null,null,null,null,null,null,null,null,null,null,"contre",null,null,null,null,null,null,null,null,null,null,"contre"]
[null,null,{"$f":"IF(D244<>\"\",'GROUPE A'!$K$22,\"\")","v":7},null,null," ",null,null,null,null,null,null,null,{"$f":"IF(O244<>\"\",'GROUPE A'!$K$23,\"\")","v":8},null,null," ",null,null,null,null,null,null,null,null,{"$f":"IF(AA244<>\"\",'GROUPE B'!$K$22,\"\")","v":15},null,null," ",null,null,null,null,null,null,null,{"$f":"IF(AL244<>\"\",'GROUPE B'!$K$23,\"\")","v":10},null,null," "]
[null,null,{"$f":"IF(C250<>\"\",VLOOKUP(C250,Liste!$C$17:$I$24,3,FALSE),\"\")","v":"FILLOU Marie-Christine"},null,null,null,null,null,null,null,null,null,null,{"$f":"IF(N250<>\"\",VLOOKUP(N250,Liste!$C$17:$I$24,3,FALSE),\"\")","v":"GOLLNISCH Laurent"},null,null,null,null,null,null,null,null,null,null,null,{"$f":"IF(Z250<>\"\",VLOOKUP(Z250,Liste!$C$30:$I$37,3,FALSE),\"\")","v":"DUBOIS Gilles"},null,null,null,null,null,null,null,null,null,null,{"$f":"IF(AK250<>\"\",VLOOKUP(AK250,Liste!$C$30:$I$37,3,FALSE),\"\")","v":"HASLE Stéphane"}]
[null,null,{"$f":"IF(C250<>\"\",VLOOKUP(C250,Liste!$C$17:$I$24,7,FALSE),\"\")","v":"SAINT-AVERTIN STT"},null,null,null,null,null,null,null,null,null,null,{"$f":"IF(N250<>\"\",VLOOKUP(N250,Liste!$C$17:$I$24,7,FALSE),\"\")","v":"MOULINS LES METZ HANDISPORT"},null,null,null,null,null,null,null,null,null,null,null,{"$f":"IF(Z250<>\"\",VLOOKUP(Z250,Liste!$C$30:$I$37,7,FALSE),\"\")","v":"LE MANS SARTHE TT"},null,null,null,null,null,null,null,null,null,null,{"$f":"IF(AK250<>\"\",VLOOKUP(AK250,Liste!$C$30:$I$37,7,FALSE),\"\")","v":"THORIGNE-FOUILLARD TT"}]
[]
[]
[]
[null,null,"CARTONS",null,null,"J","J+R 1","J+R 2",null,null,null,null,null,"CARTONS",null,null,"J","J+R 1","J+R 2",null,null,null,null,null,null,"CARTONS",null,null,"J","J+R 1","J+R 2",null,null,null,null,null,"CARTONS",null,null,"J","J+R 1","J+R 2"]
[null,null,{"$f":"C246","v":"PLET Victorien"},null,null,null,null,null,null,null,null,null,null,{"$f":"N246","v":"LE MOAL Bruno"},null,null,null,null,null,null,null,null,null,null,null,{"$f":"Z246","v":"ADJAL Yorick"},null,null,null,null,null,null,null,null,null,null,{"$f":"AK246","v":"HENOUX Frédéric"}]
[]
[null,null,{"$f":"C251","v":"FILLOU Marie-Christine"},null,null,null,null,null,null,null,null,null,null,{"$f":"N251","v":"GOLLNISCH Laurent"},null,null,null,null,null,null,null,null,null,null,null,{"$f":"Z251","v":"DUBOIS Gilles"},null,null,null,null,null,null,null,null,null,null,{"$f":"AK251","v":"HASLE Stéphane"}]
[]
[null,null,"Signature de l' Arbitre :",null,null,null,null,null,null,null,null,null,null,"Signature de l' Arbitre :",null,null,null,null,null,null,null,null,null,null,null,"Signature de l' Arbitre :",null,null,null,null,null,null,null,null,null,null,"Signature de l' Arbitre :"]
[]
[null,null,"Sitôt la partie terminée ; rapporter cette fiche à la table du Juge Arbitre;",null,null,null,null,null,null,null,null,null,null,"Sitôt la partie terminée ; rapporter cette fiche à la table du Juge Arbitre;",null,null,null,null,null,null,null,null,null,null,null,"Sitôt la partie terminée ; rapporter cette fiche à la table du Juge Arbitre;",null,null,null,null,null,null,null,null,null,null,"Sitôt la partie terminée ; rapporter cette fiche à la table du Juge Arbitre;"]
[]
[]
[null,null,{"$f":"IF(Prépa!$O$10<>0,Prépa!$O$10,\"\")","v":"Critérium Fédéral"},null,null,null,null,null,null,null,null,null,null,{"$f":"IF(Prépa!$O$10<>0,Prépa!$O$10,\"\")","v":"Critérium Fédéral"},null,null,null,null,null,null,null,null,null,null,null,{"$f":"IF(Prépa!$O$10<>0,Prépa!$O$10,\"\")","v":"Critérium Fédéral"},null,null,null,null,null,null,null,null,null,null,{"$f":"IF(Prépa!$O$10<>0,Prépa!$O$10,\"\")","v":"Critérium Fédéral"}]
[null,null,{"$f":"IF(Prépa!$D$14<>0,Prépa!$D$14,\"\")&IF(Prépa!$K$110<>0,\" - \"&Prépa!$K$110,\"\")","v":"TOURS - 10 Fevrier 2018"},null,null,null,null,null,null,null,null,null,null,{"$f":"IF(Prépa!$D$14<>0,Prépa!$D$14,\"\")&IF(Prépa!$K$110<>0,\" - \"&Prépa!$K$110,\"\")","v":"TOURS - 10 Fevrier 2018"},null,null,null,null,null,null,null,null,null,null,null,{"$f":"IF(Prépa!$D$14<>0,Prépa!$D$14,\"\")&IF(Prépa!$K$110<>0,\" - \"&Prépa!$K$110,\"\")","v":"TOURS - 10 Fevrier 2018"},null,null,null,null,null,null,null,null,null,null,{"$f":"IF(Prépa!$D$14<>0,Prépa!$D$14,\"\")&IF(Prépa!$K$110<>0,\" - \"&Prépa!$K$110,\"\")","v":"TOURS - 10 Fevrier 2018"}]
[]
[null,null,{"$f":"IF(Prépa!$O$72<>\"\",Prépa!$O$72,\"\")&IF(Prépa!$O$29<>\"\",\" - \"&Prépa!$O$29,\"\")","v":"OPEN Assis - Nat 2A Nord"},null,null,null,null,null,null,null,null,null,null,{"$f":"IF(Prépa!$O$72<>\"\",Prépa!$O$72,\"\")&IF(Prépa!$O$29<>\"\",\" - \"&Prépa!$O$29,\"\")","v":"OPEN Assis - Nat 2A Nord"},null,null,null,null,null,null,null,null,null,null,null,{"$f":"IF(Prépa!$O$72<>\"\",Prépa!$O$72,\"\")&IF(Prépa!$O$32<>\"\",\" - \"&Prépa!$O$32,\"\")","v":"OPEN Assis - Nat 2B Nord"},null,null,null,null,null,null,null,null,null,null,{"$f":"IF(Prépa!$O$72<>\"\",Prépa!$O$72,\"\")&IF(Prépa!$O$32<>\"\",\" - \"&Prépa!$O$32,\"\")","v":"OPEN Assis - Nat 2B Nord"}]
[]
[null,null,null,null,"Heure :",{"$f":"IF(Prépa!$W$34<>\"\",Prépa!$W$34,\"\")","v":"14h30"},null,null,"Table :",{"$f":"IF(Prépa!$X$34<>\"\",Prépa!$X$34,\"\")","v":3},null,null,null,null,null,"Heure :",{"$f":"IF(Prépa!$W$35<>\"\",Prépa!$W$35,\"\")","v":"14h30"},null,null,"Table :",{"$f":"IF(Prépa!$X$35<>\"\",Prépa!$X$35,\"\")","v":4},null,null,null,null,null,null,"Heure :",{"$f":"IF(Prépa!$AD$34<>\"\",Prépa!$AD$34,\"\")","v":"14h30"},null,null,"Table :",{"$f":"IF(Prépa!$AE$34<>\"\",Prépa!$AE$34,\"\")","v":7},null,null,null,null,null,"Heure :",{"$f":"IF(Prépa!$AD$35<>\"\",Prépa!$AD$35,\"\")","v":"14h30"},null,null,"Table :",{"$f":"IF(Prépa!$AE$35<>\"\",Prépa!$AE$35,\"\")","v":8}]
[]
[null,null,"Arbitre : ",null,null,null,null,null,null,null,null,null,null,"Arbitre : ",null,null,null,null,null,null,null,null,null,null,null,"Arbitre : ",null,null,null,null,null,null,null,null,null,null,"Arbitre : "]
[null,null,null,null,null,null,"17ème Partie",null,null,null,null,null,null,null,null,null,null,"18ème Partie",null,null,null,null,null,null,null,null,null,null,null,"17ème Partie",null,null,null,null,null,null,null,null,null,null,"18ème Partie"]
[null,null,null,null,null,"MANCHES",null,null,null,null,null,null,null,null,null,null,"MANCHES",null,null,null,null,null,null,null,null,null,null,null,"MANCHES",null,null,null,null,null,null,null,null,null,null,"MANCHES"]
[null,null,"PARTIE",null,null,1,2,3,4,5,6,7,null,"PARTIE",null,null,1,2,3,4,5,6,7,null,null,"PARTIE",null,null,1,2,3,4,5,6,7,null,"PARTIE",null,null,1,2,3,4,5,6,7]
[null,null,null,{"$f":"IF(AND('GROUPE A'!$C$43<>\"\",'GROUPE A'!$E$43<>\"\"),'GROUPE A'!$C$43&\" - \"&'GROUPE A'!$E$43,\"\")","v":"1 - 4"},null,"Premier service : GAUCHE - DROITE",null,null,null,null,null,null,null,null,{"$f":"IF(AND('GROUPE A'!$C$44<>\"\",'GROUPE A'!$E$44<>\"\"),'GROUPE A'!$C$44&\" - \"&'GROUPE A'!$E$44,\"\")","v":"3 - 5"},null,"Premier service : GAUCHE - DROITE",null,null,null,null,null,null,null,null,null,{"$f":"IF(AND('GROUPE B'!$C$43<>\"\",'GROUPE B'!$E$43<>\"\"),'GROUPE B'!$C$43&\" - \"&'GROUPE B'!$E$43,\"\")","v":"1 - 4"},null,"Premier service : GAUCHE - DROITE",null,null,null,null,null,null,null,null,{"$f":"IF(AND('GROUPE B'!$C$44<>\"\",'GROUPE B'!$E$44<>\"\"),'GROUPE B'!$C$44&\" - \"&'GROUPE B'!$E$44,\"\")","v":"3 - 5"},null,"Premier service : GAUCHE - DROITE"]
[null,null,{"$f":"IF(D277<>\"\",'GROUPE A'!$K$16,\"\")","v":1},null,null,null,null,null,null,null,null,null,null,{"$f":"IF(O277<>\"\",'GROUPE A'!$K$18,\"\")","v":3},null,null,null,null,null,null,null,null,null,null,null,{"$f":"IF(AA277<>\"\",'GROUPE B'!$K$16,\"\")","v":9},null,null,null,null,null,null,null,null,null,null,{"$f":"IF(AL277<>\"\",'GROUPE B'!$K$18,\"\")","v":11}]
[null,null,{"$f":"IF(C278<>\"\",VLOOKUP(C278,Liste!$C$17:$I$24,3,FALSE),\"\")","v":"RUTLER Sébastien"},null,null,null,null,null,null,null,null,null,null,{"$f":"IF(N278<>\"\",VLOOKUP(N278,Liste!$C$17:$I$24,3,FALSE),\"\")","v":"PLET Victorien"},null,null,null,null,null,null,null,null,null,null,null,{"$f":"IF(Z278<>\"\",VLOOKUP(Z278,Liste!$C$30:$I$37,3,FALSE),\"\")","v":"PAPIRER Alan"},null,null,null,null,null,null,null,null,null,null,{"$f":"IF(AK278<>\"\",VLOOKUP(AK278,Liste!$C$30:$I$37,3,FALSE),\"\")","v":"ADJAL Yorick"}]
[null,null,{"$f":"IF(C278<>\"\",VLOOKUP(C278,Liste!$C$17:$I$24,7,FALSE),\"\")","v":"PPN NEUVILLE EN FERRAIN"},null,null,null,null,null,null,null,null,null,null,{"$f":"IF(N278<>\"\",VLOOKUP(N278,Liste!$C$17:$I$24,7,FALSE),\"\")","v":"US SAINT BERTHEVIN/SAINT LOUP"},null,null,null,null,null,null,null,null,null,null,null,{"$f":"IF(Z278<>\"\",VLOOKUP(Z278,Liste!$C$30:$I$37,7,FALSE),\"\")","v":"MOULINS LES METZ HANDISPORT"},null,null,null,null,null,null,null,null,null,null,{"$f":"IF(AK278<>\"\",VLOOKUP(AK278,Liste!$C$30:$I$37,7,FALSE),\"\")","v":"A. VOISINS TT"}]
[]
[null,null,null,"contre",null,null,null,null,null,null,null,null,null,null,"contre",null,null,null,null,null,null,null,null,null,null,null,"contre",null,null,null,null,null,null,null,null,null,null,"contre"]
[null,null,{"$f":"IF(D277<>\"\",'GROUPE A'!$K$19,\"\")","v":4},null,null," ",null,null,null,null,null,null,null,{"$f":"IF(O277<>\"\",'GROUPE A'!$K$20,\"\")","v":5},null,null," ",null,null,null,null,null,null,null,null,{"$f":"IF(AA277<>\"\",'GROUPE B'!$K$19,\"\")","v":13},null,null," ",null,null,null,null,null,null,null,{"$f":"IF(AL277<>\"\",'GROUPE B'!$K$20,\"\")","v":14},null,null," "]
[null,null,{"$f":"IF(C283<>\"\",VLOOKUP(C283,Liste!$C$17:$I$24,3,FALSE),\"\")","v":"DEFRENEIX Samuel"},null,null,null,null,null,null,null,null,null,null,{"$f":"IF(N283<>\"\",VLOOKUP(N283,Liste!$C$17:$I$24,3,FALSE),\"\")","v":"MANIER William"},null,null,null,null,null,null,null,null,null,null,null,{"$f":"IF(Z283<>\"\",VLOOKUP(Z283,Liste!$C$30:$I$37,3,FALSE),\"\")","v":"KERGOSIEN Arnaud"},null,null,null,null,null,null,null,null,null,null,{"$f":"IF(AK283<>\"\",VLOOKUP(AK283,Liste!$C$30:$I$37,3,FALSE),\"\")","v":"BELTRAND Arnaud"}]
[null,null,{"$f":"IF(C283<>\"\",VLOOKUP(C283,Liste!$C$17:$I$24,7,FALSE),\"\")","v":"CTT DEOLS"},null,null,null,null,null,null,null,null,null,null,{"$f":"IF(N283<>\"\",VLOOKUP(N283,Liste!$C$17:$I$24,7,FALSE),\"\")","v":"CGL SUD OISE TT"},null,null,null,null,null,null,null,null,null,null,null,{"$f":"IF(Z283<>\"\",VLOOKUP(Z283,Liste!$C$30:$I$37,7,FALSE),\"\")","v":"F.O.L.C.L.O."},null,null,null,null,null,null,null,null,null,null,{"$f":"IF(AK283<>\"\",VLOOKUP(AK283,Liste!$C$30:$I$37,7,FALSE),\"\")","v":"TT JOUE LES TOURS"}]
[]
[]
[]
[null,null,"CARTONS",null,null,"J","J+R 1","J+R 2",null,null,null,null,null,"CARTONS",null,null,"J","J+R 1","J+R 2",null,null,null,null,null,null,"CARTONS",null,null,"J","J+R 1","J+R 2",null,null,null,null,null,"CARTONS",null,null,"J","J+R 1","J+R 2"]
[null,null,{"$f":"C279","v":"RUTLER Sébastien"},null,null,null,null,null,null,null,null,null,null,{"$f":"N279","v":"PLET Victorien"},null,null,null,null,null,null,null,null,null,null,null,{"$f":"Z279","v":"PAPIRER Alan"},null,null,null,null,null,null,null,null,null,null,{"$f":"AK279","v":"ADJAL Yorick"}]
[]
[null,null,{"$f":"C284","v":"DEFRENEIX Samuel"},null,null,null,null,null,null,null,null,null,null,{"$f":"N284","v":"MANIER William"},null,null,null,null,null,null,null,null,null,null,null,{"$f":"Z284","v":"KERGOSIEN Arnaud"},null,null,null,null,null,null,null,null,null,null,{"$f":"AK284","v":"BELTRAND Arnaud"}]
[]
[null,null,"Signature de l' Arbitre :",null,null,null,null,null,null,null,null,null,null,"Signature de l' Arbitre :",null,null,null,null,null,null,null,null,null,null,null,"Signature de l' Arbitre :",null,null,null,null,null,null,null,null,null,null,"Signature de l' Arbitre :"]
[]
[null,null,"Sitôt la partie terminée ; rapporter cette fiche à la table du Juge Arbitre;",null,null,null,null,null,null,null,null,null,null,"Sitôt la partie terminée ; rapporter cette fiche à la table du Juge Arbitre;",null,null,null,null,null,null,null,null,null,null,null,"Sitôt la partie terminée ; rapporter cette fiche à la table du Juge Arbitre;",null,null,null,null,null,null,null,null,null,null,"Sitôt la partie terminée ; rapporter cette fiche à la table du Juge Arbitre;"]
[]
[]
[null,null,{"$f":"IF(Prépa!$O$10<>0,Prépa!$O$10,\"\")","v":"Critérium Fédéral"},null,null,null,null,null,null,null,null,null,null,{"$f":"IF(Prépa!$O$10<>0,Prépa!$O$10,\"\")","v":"Critérium Fédéral"},null,null,null,null,null,null,null,null,null,null,null,{"$f":"IF(Prépa!$O$10<>0,Prépa!$O$10,\"\")","v":"Critérium Fédéral"},null,null,null,null,null,null,null,null,null,null,{"$f":"IF(Prépa!$O$10<>0,Prépa!$O$10,\"\")","v":"Critérium Fédéral"}]
[null,null,{"$f":"IF(Prépa!$D$14<>0,Prépa!$D$14,\"\")&IF(Prépa!$K$110<>0,\" - \"&Prépa!$K$110,\"\")","v":"TOURS - 10 Fevrier 2018"},null,null,null,null,null,null,null,null,null,null,{"$f":"IF(Prépa!$D$14<>0,Prépa!$D$14,\"\")&IF(Prépa!$K$110<>0,\" - \"&Prépa!$K$110,\"\")","v":"TOURS - 10 Fevrier 2018"},null,null,null,null,null,null,null,null,null,null,null,{"$f":"IF(Prépa!$D$14<>0,Prépa!$D$14,\"\")&IF(Prépa!$K$110<>0,\" - \"&Prépa!$K$110,\"\")","v":"TOURS - 10 Fevrier 2018"},null,null,null,null,null,null,null,null,null,null,{"$f":"IF(Prépa!$D$14<>0,Prépa!$D$14,\"\")&IF(Prépa!$K$110<>0,\" - \"&Prépa!$K$110,\"\")","v":"TOURS - 10 Fevrier 2018"}]
[]
[null,null,{"$f":"IF(Prépa!$O$72<>\"\",Prépa!$O$72,\"\")&IF(Prépa!$O$29<>\"\",\" - \"&Prépa!$O$29,\"\")","v":"OPEN Assis - Nat 2A Nord"},null,null,null,null,null,null,null,null,null,null,{"$f":"IF(Prépa!$O$72<>\"\",Prépa!$O$72,\"\")&IF(Prépa!$O$29<>\"\",\" - \"&Prépa!$O$29,\"\")","v":"OPEN Assis - Nat 2A Nord"},null,null,null,null,null,null,null,null,null,null,null,{"$f":"IF(Prépa!$O$72<>\"\",Prépa!$O$72,\"\")&IF(Prépa!$O$32<>\"\",\" - \"&Prépa!$O$32,\"\")","v":"OPEN Assis - Nat 2B Nord"},null,null,null,null,null,null,null,null,null,null,{"$f":"IF(Prépa!$O$72<>\"\",Prépa!$O$72,\"\")&IF(Prépa!$O$32<>\"\",\" - \"&Prépa!$O$32,\"\")","v":"OPEN Assis - Nat 2B Nord"}]
[]
[null,null,null,null,"Heure :",{"$f":"IF(Prépa!$W$36<>\"\",Prépa!$W$36,\"\")","v":"14h30"},null,null,"Table :",{"$f":"IF(Prépa!$X$36<>\"\",Prépa!$X$36,\"\")","v":1},null,null,null,null,null,"Heure :",{"$f":"IF(Prépa!$W$37<>\"\",Prépa!$W$37,\"\")","v":"14h30"},null,null,"Table :",{"$f":"IF(Prépa!$X$37<>\"\",Prépa!$X$37,\"\")","v":2},null,null,null,null,null,null,"Heure :",{"$f":"IF(Prépa!$AD$36<>\"\",Prépa!$AD$36,\"\")","v":"14h30"},null,null,"Table :",{"$f":"IF(Prépa!$AE$36<>\"\",Prépa!$AE$36,\"\")","v":5},null,null,null,null,null,"Heure :",{"$f":"IF(Prépa!$AD$37<>\"\",Prépa!$AD$37,\"\")","v":"14h30"},null,null,"Table :",{"$f":"IF(Prépa!$AE$37<>\"\",Prépa!$AE$37,\"\")","v":6}]
[]
[null,null,"Arbitre : ",null,null,null,null,null,null,null,null,null,null,"Arbitre : ",null,null,null,null,null,null,null,null,null,null,null,"Arbitre : ",null,null,null,null,null,null,null,null,null,null,"Arbitre : "]
[null,null,null,null,null,null,"19ème Partie",null,null,null,null,null,null,null,null,null,null,"20ème Partie",null,null,null,null,null,null,null,null,null,null,null,"19ème Partie",null,null,null,null,null,null,null,null,null,null,"20ème Partie"]
[null,null,null,null,null,"MANCHES",null,null,null,null,null,null,null,null,null,null,"MANCHES",null,null,null,null,null,null,null,null,null,null,null,"MANCHES",null,null,null,null,null,null,null,null,null,null,"MANCHES"]
[null,null,"PARTIE",null,null,1,2,3,4,5,6,7,null,"PARTIE",null,null,1,2,3,4,5,6,7,null,null,"PARTIE",null,null,1,2,3,4,5,6,7,null,"PARTIE",null,null,1,2,3,4,5,6,7]
[null,null,null,{"$f":"IF(AND('GROUPE A'!$C$45<>\"\",'GROUPE A'!$E$45<>\"\"),'GROUPE A'!$C$45&\" - \"&'GROUPE A'!$E$45,\"\")","v":"2 - 6"},null,"Premier service : GAUCHE - DROITE",null,null,null,null,null,null,null,null,{"$f":"IF(AND('GROUPE A'!$C$46<>\"\",'GROUPE A'!$E$46<>\"\"),'GROUPE A'!$C$46&\" - \"&'GROUPE A'!$E$46,\"\")","v":"7 - 8"},null,"Premier service : GAUCHE - DROITE",null,null,null,null,null,null,null,null,null,{"$f":"IF(AND('GROUPE B'!$C$45<>\"\",'GROUPE B'!$E$45<>\"\"),'GROUPE B'!$C$45&\" - \"&'GROUPE B'!$E$45,\"\")","v":"2 - 6"},null,"Premier service : GAUCHE - DROITE",null,null,null,null,null,null,null,null,{"$f":"IF(AND('GROUPE B'!$C$46<>\"\",'GROUPE B'!$E$46<>\"\"),'GROUPE B'!$C$46&\" - \"&'GROUPE B'!$E$46,\"\")","v":"7 - 8"},null,"Premier service : GAUCHE - DROITE"]
[null,null,{"$f":"IF(D310<>\"\",'GROUPE A'!$K$17,\"\")","v":2},null,null,null,null,null,null,null,null,null,null,{"$f":"IF(O310<>\"\",'GROUPE A'!$K$22,\"\")","v":7},null,null,null,null,null,null,null,null,null,null,null,{"$f":"IF(AA310<>\"\",'GROUPE B'!$K$17,\"\")","v":16},null,null,null,null,null,null,null,null,null,null,{"$f":"IF(AL310<>\"\",'GROUPE B'!$K$22,\"\")","v":15}]
[null,null,{"$f":"IF(C311<>\"\",VLOOKUP(C311,Liste!$C$17:$I$24,3,FALSE),\"\")","v":"LE MOAL Bruno"},null,null,null,null,null,null,null,null,null,null,{"$f":"IF(N311<>\"\",VLOOKUP(N311,Liste!$C$17:$I$24,3,FALSE),\"\")","v":"FILLOU Marie-Christine"},null,null,null,null,null,null,null,null,null,null,null,{"$f":"IF(Z311<>\"\",VLOOKUP(Z311,Liste!$C$30:$I$37,3,FALSE),\"\")","v":"HENOUX Frédéric"},null,null,null,null,null,null,null,null,null,null,{"$f":"IF(AK311<>\"\",VLOOKUP(AK311,Liste!$C$30:$I$37,3,FALSE),\"\")","v":"DUBOIS Gilles"}]
[null,null,{"$f":"IF(C311<>\"\",VLOOKUP(C311,Liste!$C$17:$I$24,7,FALSE),\"\")","v":"F.O.L.C.L.O."},null,null,null,null,null,null,null,null,null,null,{"$f":"IF(N311<>\"\",VLOOKUP(N311,Liste!$C$17:$I$24,7,FALSE),\"\")","v":"SAINT-AVERTIN STT"},null,null,null,null,null,null,null,null,null,null,null,{"$f":"IF(Z311<>\"\",VLOOKUP(Z311,Liste!$C$30:$I$37,7,FALSE),\"\")","v":"CTT CHATEAU THIERRY"},null,null,null,null,null,null,null,null,null,null,{"$f":"IF(AK311<>\"\",VLOOKUP(AK311,Liste!$C$30:$I$37,7,FALSE),\"\")","v":"LE MANS SARTHE TT"}]
[]
[null,null,null,"contre",null,null,null,null,null,null,null,null,null,null,"contre",null,null,null,null,null,null,null,null,null,null,null,"contre",null,null,null,null,null,null,null,null,null,null,"contre"]
[null,null,{"$f":"IF(D310<>\"\",'GROUPE A'!$K$21,\"\")","v":6},null,null," ",null,null,null,null,null,null,null,{"$f":"IF(O310<>\"\",'GROUPE A'!$K$23,\"\")","v":8},null,null," ",null,null,null,null,null,null,null,null,{"$f":"IF(AA310<>\"\",'GROUPE B'!$K$21,\"\")","v":12},null,null," ",null,null,null,null,null,null,null,{"$f":"IF(AL310<>\"\",'GROUPE B'!$K$23,\"\")","v":10},null,null," "]
[null,null,{"$f":"IF(C316<>\"\",VLOOKUP(C316,Liste!$C$17:$I$24,3,FALSE),\"\")","v":"PIERROT Tristan"},null,null,null,null,null,null,null,null,null,null,{"$f":"IF(N316<>\"\",VLOOKUP(N316,Liste!$C$17:$I$24,3,FALSE),\"\")","v":"GOLLNISCH Laurent"},null,null,null,null,null,null,null,null,null,null,null,{"$f":"IF(Z316<>\"\",VLOOKUP(Z316,Liste!$C$30:$I$37,3,FALSE),\"\")","v":"SIREAU GOSSIAUX Florence"},null,null,null,null,null,null,null,null,null,null,{"$f":"IF(AK316<>\"\",VLOOKUP(AK316,Liste!$C$30:$I$37,3,FALSE),\"\")","v":"HASLE Stéphane"}]
[null,null,{"$f":"IF(C316<>\"\",VLOOKUP(C316,Liste!$C$17:$I$24,7,FALSE),\"\")","v":"TT JOUE LES TOURS"},null,null,null,null,null,null,null,null,null,null,{"$f":"IF(N316<>\"\",VLOOKUP(N316,Liste!$C$17:$I$24,7,FALSE),\"\")","v":"MOULINS LES METZ HANDISPORT"},null,null,null,null,null,null,null,null,null,null,null,{"$f":"IF(Z316<>\"\",VLOOKUP(Z316,Liste!$C$30:$I$37,7,FALSE),\"\")","v":"A. VOISINS TT"},null,null,null,null,null,null,null,null,null,null,{"$f":"IF(AK316<>\"\",VLOOKUP(AK316,Liste!$C$30:$I$37,7,FALSE),\"\")","v":"THORIGNE-FOUILLARD TT"}]
[]
[]
[]
[null,null,"CARTONS",null,null,"J","J+R 1","J+R 2",null,null,null,null,null,"CARTONS",null,null,"J","J+R 1","J+R 2",null,null,null,null,null,null,"CARTONS",null,null,"J","J+R 1","J+R 2",null,null,null,null,null,"CARTONS",null,null,"J","J+R 1","J+R 2"]
[null,null,{"$f":"C312","v":"LE MOAL Bruno"},null,null,null,null,null,null,null,null,null,null,{"$f":"N312","v":"FILLOU Marie-Christine"},null,null,null,null,null,null,null,null,null,null,null,{"$f":"Z312","v":"HENOUX Frédéric"},null,null,null,null,null,null,null,null,null,null,{"$f":"AK312","v":"DUBOIS Gilles"}]
[]
[null,null,{"$f":"C317","v":"PIERROT Tristan"},null,null,null,null,null,null,null,null,null,null,{"$f":"N317","v":"GOLLNISCH Laurent"},null,null,null,null,null,null,null,null,null,null,null,{"$f":"Z317","v":"SIREAU GOSSIAUX Florence"},null,null,null,null,null,null,null,null,null,null,{"$f":"AK317","v":"HASLE Stéphane"}]
[]
[null,null,"Signature de l' Arbitre :",null,null,null,null,null,null,null,null,null,null,"Signature de l' Arbitre :",null,null,null,null,null,null,null,null,null,null,null,"Signature de l' Arbitre :",null,null,null,null,null,null,null,null,null,null,"Signature de l' Arbitre :"]
[]
[null,null,"Sitôt la partie terminée ; rapporter cette fiche à la table du Juge Arbitre;",null,null,null,null,null,null,null,null,null,null,"Sitôt la partie terminée ; rapporter cette fiche à la table du Juge Arbitre;",null,null,null,null,null,null,null,null,null,null,null,"Sitôt la partie terminée ; rapporter cette fiche à la table du Juge Arbitre;",null,null,null,null,null,null,null,null,null,null,"Sitôt la partie terminée ; rapporter cette fiche à la table du Juge Arbitre;"]
[]
[]
[null,null,{"$f":"IF(Prépa!$O$10<>0,Prépa!$O$10,\"\")","v":"Critérium Fédéral"},null,null,null,null,null,null,null,null,null,null,{"$f":"IF(Prépa!$O$10<>0,Prépa!$O$10,\"\")","v":"Critérium Fédéral"},null,null,null,null,null,null,null,null,null,null,null,{"$f":"IF(Prépa!$O$10<>0,Prépa!$O$10,\"\")","v":"Critérium Fédéral"},null,null,null,null,null,null,null,null,null,null,{"$f":"IF(Prépa!$O$10<>0,Prépa!$O$10,\"\")","v":"Critérium Fédéral"}]
[null,null,{"$f":"IF(Prépa!$D$14<>0,Prépa!$D$14,\"\")&IF(Prépa!$K$110<>0,\" - \"&Prépa!$K$110,\"\")","v":"TOURS - 10 Fevrier 2018"},null,null,null,null,null,null,null,null,null,null,{"$f":"IF(Prépa!$D$14<>0,Prépa!$D$14,\"\")&IF(Prépa!$K$110<>0,\" - \"&Prépa!$K$110,\"\")","v":"TOURS - 10 Fevrier 2018"},null,null,null,null,null,null,null,null,null,null,null,{"$f":"IF(Prépa!$D$14<>0,Prépa!$D$14,\"\")&IF(Prépa!$K$110<>0,\" - \"&Prépa!$K$110,\"\")","v":"TOURS - 10 Fevrier 2018"},null,null,null,null,null,null,null,null,null,null,{"$f":"IF(Prépa!$D$14<>0,Prépa!$D$14,\"\")&IF(Prépa!$K$110<>0,\" - \"&Prépa!$K$110,\"\")","v":"TOURS - 10 Fevrier 2018"}]
[]
[null,null,{"$f":"IF(Prépa!$O$72<>\"\",Prépa!$O$72,\"\")&IF(Prépa!$O$29<>\"\",\" - \"&Prépa!$O$29,\"\")","v":"OPEN Assis - Nat 2A Nord"},null,null,null,null,null,null,null,null,null,null,{"$f":"IF(Prépa!$O$72<>\"\",Prépa!$O$72,\"\")&IF(Prépa!$O$29<>\"\",\" - \"&Prépa!$O$29,\"\")","v":"OPEN Assis - Nat 2A Nord"},null,null,null,null,null,null,null,null,null,null,null,{"$f":"IF(Prépa!$O$72<>\"\",Prépa!$O$72,\"\")&IF(Prépa!$O$32<>\"\",\" - \"&Prépa!$O$32,\"\")","v":"OPEN Assis - Nat 2B Nord"},null,null,null,null,null,null,null,null,null,null,{"$f":"IF(Prépa!$O$72<>\"\",Prépa!$O$72,\"\")&IF(Prépa!$O$32<>\"\",\" - \"&Prépa!$O$32,\"\")","v":"OPEN Assis - Nat 2B Nord"}]
[]
[null,null,null,null,"Heure :",{"$f":"IF(Prépa!$W$41<>\"\",Prépa!$W$41,\"\")","v":"15h30"},null,null,"Table :",{"$f":"IF(Prépa!$X$41<>\"\",Prépa!$X$41,\"\")","v":7},null,null,null,null,null,"Heure :",{"$f":"IF(Prépa!$W$42<>\"\",Prépa!$W$42,\"\")","v":"15h30"},null,null,"Table :",{"$f":"IF(Prépa!$X$42<>\"\",Prépa!$X$42,\"\")","v":8},null,null,null,null,null,null,"Heure :",{"$f":"IF(Prépa!$AD$41<>\"\",Prépa!$AD$41,\"\")","v":"15h30"},null,null,"Table :",{"$f":"IF(Prépa!$AE$41<>\"\",Prépa!$AE$41,\"\")","v":3},null,null,null,null,null,"Heure :",{"$f":"IF(Prépa!$AD$42<>\"\",Prépa!$AD$42,\"\")","v":"15h30"},null,null,"Table :",{"$f":"IF(Prépa!$AE$42<>\"\",Prépa!$AE$42,\"\")","v":4}]
[]
[null,null,"Arbitre : ",null,null,null,null,null,null,null,null,null,null,"Arbitre : ",null,null,null,null,null,null,null,null,null,null,null,"Arbitre : ",null,null,null,null,null,null,null,null,null,null,"Arbitre : "]
[null,null,null,null,null,null,"21ème Partie",null,null,null,null,null,null,null,null,null,null,"22ème Partie",null,null,null,null,null,null,null,null,null,null,null,"21ème Partie",null,null,null,null,null,null,null,null,null,null,"22ème Partie"]
[null,null,null,null,null,"MANCHES",null,null,null,null,null,null,null,null,null,null,"MANCHES",null,null,null,null,null,null,null,null,null,null,null,"MANCHES",null,null,null,null,null,null,null,null,null,null,"MANCHES"]
[null,null,"PARTIE",null,null,1,2,3,4,5,6,7,null,"PARTIE",null,null,1,2,3,4,5,6,7,null,null,"PARTIE",null,null,1,2,3,4,5,6,7,null,"PARTIE",null,null,1,2,3,4,5,6,7]
[null,null,null,{"$f":"IF(AND('GROUPE A'!$C$47<>\"\",'GROUPE A'!$E$47<>\"\"),'GROUPE A'!$C$47&\" - \"&'GROUPE A'!$E$47,\"\")","v":"1 - 3"},null,"Premier service : GAUCHE - DROITE",null,null,null,null,null,null,null,null,{"$f":"IF(AND('GROUPE A'!$C$48<>\"\",'GROUPE A'!$E$48<>\"\"),'GROUPE A'!$C$48&\" - \"&'GROUPE A'!$E$48,\"\")","v":"2 - 4"},null,"Premier service : GAUCHE - DROITE",null,null,null,null,null,null,null,null,null,{"$f":"IF(AND('GROUPE B'!$C$47<>\"\",'GROUPE B'!$E$47<>\"\"),'GROUPE B'!$C$47&\" - \"&'GROUPE B'!$E$47,\"\")","v":"1 - 3"},null,"Premier service : GAUCHE - DROITE",null,null,null,null,null,null,null,null,{"$f":"IF(AND('GROUPE B'!$C$48<>\"\",'GROUPE B'!$E$48<>\"\"),'GROUPE B'!$C$48&\" - \"&'GROUPE B'!$E$48,\"\")","v":"2 - 4"},null,"Premier service : GAUCHE - DROITE"]
[null,null,{"$f":"IF(D343<>\"\",'GROUPE A'!$K$16,\"\")","v":1},null,null,null,null,null,null,null,null,null,null,{"$f":"IF(O343<>\"\",'GROUPE A'!$K$17,\"\")","v":2},null,null,null,null,null,null,null,null,null,null,null,{"$f":"IF(AA343<>\"\",'GROUPE B'!$K$16,\"\")","v":9},null,null,null,null,null,null,null,null,null,null,{"$f":"IF(AL343<>\"\",'GROUPE B'!$K$17,\"\")","v":16}]
[null,null,{"$f":"IF(C344<>\"\",VLOOKUP(C344,Liste!$C$17:$I$24,3,FALSE),\"\")","v":"RUTLER Sébastien"},null,null,null,null,null,null,null,null,null,null,{"$f":"IF(N344<>\"\",VLOOKUP(N344,Liste!$C$17:$I$24,3,FALSE),\"\")","v":"LE MOAL Bruno"},null,null,null,null,null,null,null,null,null,null,null,{"$f":"IF(Z344<>\"\",VLOOKUP(Z344,Liste!$C$30:$I$37,3,FALSE),\"\")","v":"PAPIRER Alan"},null,null,null,null,null,null,null,null,null,null,{"$f":"IF(AK344<>\"\",VLOOKUP(AK344,Liste!$C$30:$I$37,3,FALSE),\"\")","v":"HENOUX Frédéric"}]
[null,null,{"$f":"IF(C344<>\"\",VLOOKUP(C344,Liste!$C$17:$I$24,7,FALSE),\"\")","v":"PPN NEUVILLE EN FERRAIN"},null,null,null,null,null,null,null,null,null,null,{"$f":"IF(N344<>\"\",VLOOKUP(N344,Liste!$C$17:$I$24,7,FALSE),\"\")","v":"F.O.L.C.L.O."},null,null,null,null,null,null,null,null,null,null,null,{"$f":"IF(Z344<>\"\",VLOOKUP(Z344,Liste!$C$30:$I$37,7,FALSE),\"\")","v":"MOULINS LES METZ HANDISPORT"},null,null,null,null,null,null,null,null,null,null,{"$f":"IF(AK344<>\"\",VLOOKUP(AK344,Liste!$C$30:$I$37,7,FALSE),\"\")","v":"CTT CHATEAU THIERRY"}]
[]
[null,null,null,"contre",null,null,null,null,null,null,null,null,null,null,"contre",null,null,null,null,null,null,null,null,null,null,null,"contre",null,null,null,null,null,null,null,null,null,null,"contre"]
[null,null,{"$f":"IF(D343<>\"\",'GROUPE A'!$K$18,\"\")","v":3},null,null," ",null,null,null,null,null,null,null,{"$f":"IF(O343<>\"\",'GROUPE A'!$K$19,\"\")","v":4},null,null," ",null,null,null,null,null,null,null,null,{"$f":"IF(AA343<>\"\",'GROUPE B'!$K$18,\"\")","v":11},null,null," ",null,null,null,null,null,null,null,{"$f":"IF(AL343<>\"\",'GROUPE B'!$K$19,\"\")","v":13},null,null," "]
[null,null,{"$f":"IF(C349<>\"\",VLOOKUP(C349,Liste!$C$17:$I$24,3,FALSE),\"\")","v":"PLET Victorien"},null,null,null,null,null,null,null,null,null,null,{"$f":"IF(N349<>\"\",VLOOKUP(N349,Liste!$C$17:$I$24,3,FALSE),\"\")","v":"DEFRENEIX Samuel"},null,null,null,null,null,null,null,null,null,null,null,{"$f":"IF(Z349<>\"\",VLOOKUP(Z349,Liste!$C$30:$I$37,3,FALSE),\"\")","v":"ADJAL Yorick"},null,null,null,null,null,null,null,null,null,null,{"$f":"IF(AK349<>\"\",VLOOKUP(AK349,Liste!$C$30:$I$37,3,FALSE),\"\")","v":"KERGOSIEN Arnaud"}]
[null,null,{"$f":"IF(C349<>\"\",VLOOKUP(C349,Liste!$C$17:$I$24,7,FALSE),\"\")","v":"US SAINT BERTHEVIN/SAINT LOUP"},null,null,null,null,null,null,null,null,null,null,{"$f":"IF(N349<>\"\",VLOOKUP(N349,Liste!$C$17:$I$24,7,FALSE),\"\")","v":"CTT DEOLS"},null,null,null,null,null,null,null,null,null,null,null,{"$f":"IF(Z349<>\"\",VLOOKUP(Z349,Liste!$C$30:$I$37,7,FALSE),\"\")","v":"A. VOISINS TT"},null,null,null,null,null,null,null,null,null,null,{"$f":"IF(AK349<>\"\",VLOOKUP(AK349,Liste!$C$30:$I$37,7,FALSE),\"\")","v":"F.O.L.C.L.O."}]
[]
[]
[]
[null,null,"CARTONS",null,null,"J","J+R 1","J+R 2",null,null,null,null,null,"CARTONS",null,null,"J","J+R 1","J+R 2",null,null,null,null,null,null,"CARTONS",null,null,"J","J+R 1","J+R 2",null,null,null,null,null,"CARTONS",null,null,"J","J+R 1","J+R 2"]
[null,null,{"$f":"C345","v":"RUTLER Sébastien"},null,null,null,null,null,null,null,null,null,null,{"$f":"N345","v":"LE MOAL Bruno"},null,null,null,null,null,null,null,null,null,null,null,{"$f":"Z345","v":"PAPIRER Alan"},null,null,null,null,null,null,null,null,null,null,{"$f":"AK345","v":"HENOUX Frédéric"}]
[]
[null,null,{"$f":"C350","v":"PLET Victorien"},null,null,null,null,null,null,null,null,null,null,{"$f":"N350","v":"DEFRENEIX Samuel"},null,null,null,null,null,null,null,null,null,null,null,{"$f":"Z350","v":"ADJAL Yorick"},null,null,null,null,null,null,null,null,null,null,{"$f":"AK350","v":"KERGOSIEN Arnaud"}]
[]
[null,null,"Signature de l' Arbitre :",null,null,null,null,null,null,null,null,null,null,"Signature de l' Arbitre :",null,null,null,null,null,null,null,null,null,null,null,"Signature de l' Arbitre :",null,null,null,null,null,null,null,null,null,null,"Signature de l' Arbitre :"]
[]
[null,null,"Sitôt la partie terminée ; rapporter cette fiche à la table du Juge Arbitre;",null,null,null,null,null,null,null,null,null,null,"Sitôt la partie terminée ; rapporter cette fiche à la table du Juge Arbitre;",null,null,null,null,null,null,null,null,null,null,null,"Sitôt la partie terminée ; rapporter cette fiche à la table du Juge Arbitre;",null,null,null,null,null,null,null,null,null,null,"Sitôt la partie terminée ; rapporter cette fiche à la table du Juge Arbitre;"]
[]
[]
[null,null,{"$f":"IF(Prépa!$O$10<>0,Prépa!$O$10,\"\")","v":"Critérium Fédéral"},null,null,null,null,null,null,null,null,null,null,{"$f":"IF(Prépa!$O$10<>0,Prépa!$O$10,\"\")","v":"Critérium Fédéral"},null,null,null,null,null,null,null,null,null,null,null,{"$f":"IF(Prépa!$O$10<>0,Prépa!$O$10,\"\")","v":"Critérium Fédéral"},null,null,null,null,null,null,null,null,null,null,{"$f":"IF(Prépa!$O$10<>0,Prépa!$O$10,\"\")","v":"Critérium Fédéral"}]
[null,null,{"$f":"IF(Prépa!$D$14<>0,Prépa!$D$14,\"\")&IF(Prépa!$K$110<>0,\" - \"&Prépa!$K$110,\"\")","v":"TOURS - 10 Fevrier 2018"},null,null,null,null,null,null,null,null,null,null,{"$f":"IF(Prépa!$D$14<>0,Prépa!$D$14,\"\")&IF(Prépa!$K$110<>0,\" - \"&Prépa!$K$110,\"\")","v":"TOURS - 10 Fevrier 2018"},null,null,null,null,null,null,null,null,null,null,null,{"$f":"IF(Prépa!$D$14<>0,Prépa!$D$14,\"\")&IF(Prépa!$K$110<>0,\" - \"&Prépa!$K$110,\"\")","v":"TOURS - 10 Fevrier 2018"},null,null,null,null,null,null,null,null,null,null,{"$f":"IF(Prépa!$D$14<>0,Prépa!$D$14,\"\")&IF(Prépa!$K$110<>0,\" - \"&Prépa!$K$110,\"\")","v":"TOURS - 10 Fevrier 2018"}]
[]
[null,null,{"$f":"IF(Prépa!$O$72<>\"\",Prépa!$O$72,\"\")&IF(Prépa!$O$29<>\"\",\" - \"&Prépa!$O$29,\"\")","v":"OPEN Assis - Nat 2A Nord"},null,null,null,null,null,null,null,null,null,null,{"$f":"IF(Prépa!$O$72<>\"\",Prépa!$O$72,\"\")&IF(Prépa!$O$29<>\"\",\" - \"&Prépa!$O$29,\"\")","v":"OPEN Assis - Nat 2A Nord"},null,null,null,null,null,null,null,null,null,null,null,{"$f":"IF(Prépa!$O$72<>\"\",Prépa!$O$72,\"\")&IF(Prépa!$O$32<>\"\",\" - \"&Prépa!$O$32,\"\")","v":"OPEN Assis - Nat 2B Nord"},null,null,null,null,null,null,null,null,null,null,{"$f":"IF(Prépa!$O$72<>\"\",Prépa!$O$72,\"\")&IF(Prépa!$O$32<>\"\",\" - \"&Prépa!$O$32,\"\")","v":"OPEN Assis - Nat 2B Nord"}]
[]
[null,null,null,null,"Heure :",{"$f":"IF(Prépa!$W$43<>\"\",Prépa!$W$43,\"\")","v":"15h30"},null,null,"Table :",{"$f":"IF(Prépa!$X$43<>\"\",Prépa!$X$43,\"\")","v":5},null,null,null,null,null,"Heure :",{"$f":"IF(Prépa!$W$44<>\"\",Prépa!$W$44,\"\")","v":"15h30"},null,null,"Table :",{"$f":"IF(Prépa!$X$44<>\"\",Prépa!$X$44,\"\")","v":6},null,null,null,null,null,null,"Heure :",{"$f":"IF(Prépa!$AD$43<>\"\",Prépa!$AD$43,\"\")","v":"15h30"},null,null,"Table :",{"$f":"IF(Prépa!$AE$43<>\"\",Prépa!$AE$43,\"\")","v":1},null,null,null,null,null,"Heure :",{"$f":"IF(Prépa!$AD$44<>\"\",Prépa!$AD$44,\"\")","v":"15h30"},null,null,"Table :",{"$f":"IF(Prépa!$AE$44<>\"\",Prépa!$AE$44,\"\")","v":2}]
[]
[null,null,"Arbitre : ",null,null,null,null,null,null,null,null,null,null,"Arbitre : ",null,null,null,null,null,null,null,null,null,null,null,"Arbitre : ",null,null,null,null,null,null,null,null,null,null,"Arbitre : "]
[null,null,null,null,null,null,"23ème Partie",null,null,null,null,null,null,null,null,null,null,"24ème Partie",null,null,null,null,null,null,null,null,null,null,null,"23ème Partie",null,null,null,null,null,null,null,null,null,null,"24ème Partie"]
[null,null,null,null,null,"MANCHES",null,null,null,null,null,null,null,null,null,null,"MANCHES",null,null,null,null,null,null,null,null,null,null,null,"MANCHES",null,null,null,null,null,null,null,null,null,null,"MANCHES"]
[null,null,"PARTIE",null,null,1,2,3,4,5,6,7,null,"PARTIE",null,null,1,2,3,4,5,6,7,null,null,"PARTIE",null,null,1,2,3,4,5,6,7,null,"PARTIE",null,null,1,2,3,4,5,6,7]
[null,null,null,{"$f":"IF(AND('GROUPE A'!$C$49<>\"\",'GROUPE A'!$E$49<>\"\"),'GROUPE A'!$C$49&\" - \"&'GROUPE A'!$E$49,\"\")","v":"5 - 8"},null,"Premier service : GAUCHE - DROITE",null,null,null,null,null,null,null,null,{"$f":"IF(AND('GROUPE A'!$C$50<>\"\",'GROUPE A'!$E$50<>\"\"),'GROUPE A'!$C$50&\" - \"&'GROUPE A'!$E$50,\"\")","v":"6 - 7"},null,"Premier service : GAUCHE - DROITE",null,null,null,null,null,null,null,null,null,{"$f":"IF(AND('GROUPE B'!$C$49<>\"\",'GROUPE B'!$E$49<>\"\"),'GROUPE B'!$C$49&\" - \"&'GROUPE B'!$E$49,\"\")","v":"5 - 8"},null,"Premier service : GAUCHE - DROITE",null,null,null,null,null,null,null,null,{"$f":"IF(AND('GROUPE B'!$C$50<>\"\",'GROUPE B'!$E$50<>\"\"),'GROUPE B'!$C$50&\" - \"&'GROUPE B'!$E$50,\"\")","v":"6 - 7"},null,"Premier service : GAUCHE - DROITE"]
[null,null,{"$f":"IF(D376<>\"\",'GROUPE A'!$K$20,\"\")","v":5},null,null,null,null,null,null,null,null,null,null,{"$f":"IF(O376<>\"\",'GROUPE A'!$K$21,\"\")","v":6},null,null,null,null,null,null,null,null,null,null,null,{"$f":"IF(AA376<>\"\",'GROUPE B'!$K$20,\"\")","v":14},null,null,null,null,null,null,null,null,null,null,{"$f":"IF(AL376<>\"\",'GROUPE B'!$K$21,\"\")","v":12}]
[null,null,{"$f":"IF(C377<>\"\",VLOOKUP(C377,Liste!$C$17:$I$24,3,FALSE),\"\")","v":"MANIER William"},null,null,null,null,null,null,null,null,null,null,{"$f":"IF(N377<>\"\",VLOOKUP(N377,Liste!$C$17:$I$24,3,FALSE),\"\")","v":"PIERROT Tristan"},null,null,null,null,null,null,null,null,null,null,null,{"$f":"IF(Z377<>\"\",VLOOKUP(Z377,Liste!$C$30:$I$37,3,FALSE),\"\")","v":"BELTRAND Arnaud"},null,null,null,null,null,null,null,null,null,null,{"$f":"IF(AK377<>\"\",VLOOKUP(AK377,Liste!$C$30:$I$37,3,FALSE),\"\")","v":"SIREAU GOSSIAUX Florence"}]
[null,null,{"$f":"IF(C377<>\"\",VLOOKUP(C377,Liste!$C$17:$I$24,7,FALSE),\"\")","v":"CGL SUD OISE TT"},null,null,null,null,null,null,null,null,null,null,{"$f":"IF(N377<>\"\",VLOOKUP(N377,Liste!$C$17:$I$24,7,FALSE),\"\")","v":"TT JOUE LES TOURS"},null,null,null,null,null,null,null,null,null,null,null,{"$f":"IF(Z377<>\"\",VLOOKUP(Z377,Liste!$C$30:$I$37,7,FALSE),\"\")","v":"TT JOUE LES TOURS"},null,null,null,null,null,null,null,null,null,null,{"$f":"IF(AK377<>\"\",VLOOKUP(AK377,Liste!$C$30:$I$37,7,FALSE),\"\")","v":"A. VOISINS TT"}]
[]
[null,null,null,"contre",null,null,null,null,null,null,null,null,null,null,"contre",null,null,null,null,null,null,null,null,null,null,null,"contre",null,null,null,null,null,null,null,null,null,null,"contre"]
[null,null,{"$f":"IF(D376<>\"\",'GROUPE A'!$K$23,\"\")","v":8},null,null," ",null,null,null,null,null,null,null,{"$f":"IF(O376<>\"\",'GROUPE A'!$K$22,\"\")","v":7},null,null," ",null,null,null,null,null,null,null,null,{"$f":"IF(AA376<>\"\",'GROUPE B'!$K$23,\"\")","v":10},null,null," ",null,null,null,null,null,null,null,{"$f":"IF(AL376<>\"\",'GROUPE B'!$K$22,\"\")","v":15},null,null," "]
[null,null,{"$f":"IF(C382<>\"\",VLOOKUP(C382,Liste!$C$17:$I$24,3,FALSE),\"\")","v":"GOLLNISCH Laurent"},null,null,null,null,null,null,null,null,null,null,{"$f":"IF(N382<>\"\",VLOOKUP(N382,Liste!$C$17:$I$24,3,FALSE),\"\")","v":"FILLOU Marie-Christine"},null,null,null,null,null,null,null,null,null,null,null,{"$f":"IF(Z382<>\"\",VLOOKUP(Z382,Liste!$C$30:$I$37,3,FALSE),\"\")","v":"HASLE Stéphane"},null,null,null,null,null,null,null,null,null,null,{"$f":"IF(AK382<>\"\",VLOOKUP(AK382,Liste!$C$30:$I$37,3,FALSE),\"\")","v":"DUBOIS Gilles"}]
[null,null,{"$f":"IF(C382<>\"\",VLOOKUP(C382,Liste!$C$17:$I$24,7,FALSE),\"\")","v":"MOULINS LES METZ HANDISPORT"},null,null,null,null,null,null,null,null,null,null,{"$f":"IF(N382<>\"\",VLOOKUP(N382,Liste!$C$17:$I$24,7,FALSE),\"\")","v":"SAINT-AVERTIN STT"},null,null,null,null,null,null,null,null,null,null,null,{"$f":"IF(Z382<>\"\",VLOOKUP(Z382,Liste!$C$30:$I$37,7,FALSE),\"\")","v":"THORIGNE-FOUILLARD TT"},null,null,null,null,null,null,null,null,null,null,{"$f":"IF(AK382<>\"\",VLOOKUP(AK382,Liste!$C$30:$I$37,7,FALSE),\"\")","v":"LE MANS SARTHE TT"}]
[]
[]
[]
[null,null,"CARTONS",null,null,"J","J+R 1","J+R 2",null,null,null,null,null,"CARTONS",null,null,"J","J+R 1","J+R 2",null,null,null,null,null,null,"CARTONS",null,null,"J","J+R 1","J+R 2",null,null,null,null,null,"CARTONS",null,null,"J","J+R 1","J+R 2"]
[null,null,{"$f":"C378","v":"MANIER William"},null,null,null,null,null,null,null,null,null,null,{"$f":"N378","v":"PIERROT Tristan"},null,null,null,null,null,null,null,null,null,null,null,{"$f":"Z378","v":"BELTRAND Arnaud"},null,null,null,null,null,null,null,null,null,null,{"$f":"AK378","v":"SIREAU GOSSIAUX Florence"}]
[]
[null,null,{"$f":"C383","v":"GOLLNISCH Laurent"},null,null,null,null,null,null,null,null,null,null,{"$f":"N383","v":"FILLOU Marie-Christine"},null,null,null,null,null,null,null,null,null,null,null,{"$f":"Z383","v":"HASLE Stéphane"},null,null,null,null,null,null,null,null,null,null,{"$f":"AK383","v":"DUBOIS Gilles"}]
[]
[null,null,"Signature de l' Arbitre :",null,null,null,null,null,null,null,null,null,null,"Signature de l' Arbitre :",null,null,null,null,null,null,null,null,null,null,null,"Signature de l' Arbitre :",null,null,null,null,null,null,null,null,null,null,"Signature de l' Arbitre :"]
[]
[null,null,"Sitôt la partie terminée ; rapporter cette fiche à la table du Juge Arbitre;",null,null,null,null,null,null,null,null,null,null,"Sitôt la partie terminée ; rapporter cette fiche à la table du Juge Arbitre;",null,null,null,null,null,null,null,null,null,null,null,"Sitôt la partie terminée ; rapporter cette fiche à la table du Juge Arbitre;",null,null,null,null,null,null,null,null,null,null,"Sitôt la partie terminée ; rapporter cette fiche à la table du Juge Arbitre;"]
[]
[]
[null,null,{"$f":"IF(Prépa!$O$10<>0,Prépa!$O$10,\"\")","v":"Critérium Fédéral"},null,null,null,null,null,null,null,null,null,null,{"$f":"IF(Prépa!$O$10<>0,Prépa!$O$10,\"\")","v":"Critérium Fédéral"},null,null,null,null,null,null,null,null,null,null,null,{"$f":"IF(Prépa!$O$10<>0,Prépa!$O$10,\"\")","v":"Critérium Fédéral"},null,null,null,null,null,null,null,null,null,null,{"$f":"IF(Prépa!$O$10<>0,Prépa!$O$10,\"\")","v":"Critérium Fédéral"}]
[null,null,{"$f":"IF(Prépa!$D$14<>0,Prépa!$D$14,\"\")&IF(Prépa!$K$110<>0,\" - \"&Prépa!$K$110,\"\")","v":"TOURS - 10 Fevrier 2018"},null,null,null,null,null,null,null,null,null,null,{"$f":"IF(Prépa!$D$14<>0,Prépa!$D$14,\"\")&IF(Prépa!$K$110<>0,\" - \"&Prépa!$K$110,\"\")","v":"TOURS - 10 Fevrier 2018"},null,null,null,null,null,null,null,null,null,null,null,{"$f":"IF(Prépa!$D$14<>0,Prépa!$D$14,\"\")&IF(Prépa!$K$110<>0,\" - \"&Prépa!$K$110,\"\")","v":"TOURS - 10 Fevrier 2018"},null,null,null,null,null,null,null,null,null,null,{"$f":"IF(Prépa!$D$14<>0,Prépa!$D$14,\"\")&IF(Prépa!$K$110<>0,\" - \"&Prépa!$K$110,\"\")","v":"TOURS - 10 Fevrier 2018"}]
[]
[null,null,{"$f":"IF(Prépa!$O$72<>\"\",Prépa!$O$72,\"\")&IF(Prépa!$O$29<>\"\",\" - \"&Prépa!$O$29,\"\")","v":"OPEN Assis - Nat 2A Nord"},null,null,null,null,null,null,null,null,null,null,{"$f":"IF(Prépa!$O$72<>\"\",Prépa!$O$72,\"\")&IF(Prépa!$O$29<>\"\",\" - \"&Prépa!$O$29,\"\")","v":"OPEN Assis - Nat 2A Nord"},null,null,null,null,null,null,null,null,null,null,null,{"$f":"IF(Prépa!$O$72<>\"\",Prépa!$O$72,\"\")&IF(Prépa!$O$32<>\"\",\" - \"&Prépa!$O$32,\"\")","v":"OPEN Assis - Nat 2B Nord"},null,null,null,null,null,null,null,null,null,null,{"$f":"IF(Prépa!$O$72<>\"\",Prépa!$O$72,\"\")&IF(Prépa!$O$32<>\"\",\" - \"&Prépa!$O$32,\"\")","v":"OPEN Assis - Nat 2B Nord"}]
[]
[null,null,null,null,"Heure :",{"$f":"IF(Prépa!$W$48<>\"\",Prépa!$W$48,\"\")","v":"16h30"},null,null,"Table :",{"$f":"IF(Prépa!$X$48<>\"\",Prépa!$X$48,\"\")","v":1},null,null,null,null,null,"Heure :",{"$f":"IF(Prépa!$W$49<>\"\",Prépa!$W$49,\"\")","v":"16h30"},null,null,"Table :",{"$f":"IF(Prépa!$X$49<>\"\",Prépa!$X$49,\"\")","v":2},null,null,null,null,null,null,"Heure :",{"$f":"IF(Prépa!$AD$48<>\"\",Prépa!$AD$48,\"\")","v":"16h30"},null,null,"Table :",{"$f":"IF(Prépa!$AE$48<>\"\",Prépa!$AE$48,\"\")","v":8},null,null,null,null,null,"Heure :",{"$f":"IF(Prépa!$AD$49<>\"\",Prépa!$AD$49,\"\")","v":"16h30"},null,null,"Table :",{"$f":"IF(Prépa!$AE$49<>\"\",Prépa!$AE$49,\"\")","v":7}]
[]
[null,null,"Arbitre : ",null,null,null,null,null,null,null,null,null,null,"Arbitre : ",null,null,null,null,null,null,null,null,null,null,null,"Arbitre : ",null,null,null,null,null,null,null,null,null,null,"Arbitre : "]
[null,null,null,null,null,null,"25ème Partie",null,null,null,null,null,null,null,null,null,null,"26ème Partie",null,null,null,null,null,null,null,null,null,null,null,"25ème Partie",null,null,null,null,null,null,null,null,null,null,"26ème Partie"]
[null,null,null,null,null,"MANCHES",null,null,null,null,null,null,null,null,null,null,"MANCHES",null,null,null,null,null,null,null,null,null,null,null,"MANCHES",null,null,null,null,null,null,null,null,null,null,"MANCHES"]
[null,null,"PARTIE",null,null,1,2,3,4,5,6,7,null,"PARTIE",null,null,1,2,3,4,5,6,7,null,null,"PARTIE",null,null,1,2,3,4,5,6,7,null,"PARTIE",null,null,1,2,3,4,5,6,7]
[null,null,null,{"$f":"IF(AND('GROUPE A'!$C$51<>\"\",'GROUPE A'!$E$51<>\"\"),'GROUPE A'!$C$51&\" - \"&'GROUPE A'!$E$51,\"\")","v":"1 - 2"},null,"Premier service : GAUCHE - DROITE",null,null,null,null,null,null,null,null,{"$f":"IF(AND('GROUPE A'!$C$52<>\"\",'GROUPE A'!$E$52<>\"\"),'GROUPE A'!$C$52&\" - \"&'GROUPE A'!$E$52,\"\")","v":"3 - 8"},null,"Premier service : GAUCHE - DROITE",null,null,null,null,null,null,null,null,null,{"$f":"IF(AND('GROUPE B'!$C$51<>\"\",'GROUPE B'!$E$51<>\"\"),'GROUPE B'!$C$51&\" - \"&'GROUPE B'!$E$51,\"\")","v":"1 - 2"},null,"Premier service : GAUCHE - DROITE",null,null,null,null,null,null,null,null,{"$f":"IF(AND('GROUPE B'!$C$52<>\"\",'GROUPE B'!$E$52<>\"\"),'GROUPE B'!$C$52&\" - \"&'GROUPE B'!$E$52,\"\")","v":"3 - 8"},null,"Premier service : GAUCHE - DROITE"]
[null,null,{"$f":"IF(D409<>\"\",'GROUPE A'!$K$16,\"\")","v":1},null,null,null,null,null,null,null,null,null,null,{"$f":"IF(O409<>\"\",'GROUPE A'!$K$18,\"\")","v":3},null,null,null,null,null,null,null,null,null,null,null,{"$f":"IF(AA409<>\"\",'GROUPE B'!$K$16,\"\")","v":9},null,null,null,null,null,null,null,null,null,null,{"$f":"IF(AL409<>\"\",'GROUPE B'!$K$18,\"\")","v":11}]
[null,null,{"$f":"IF(C410<>\"\",VLOOKUP(C410,Liste!$C$17:$I$24,3,FALSE),\"\")","v":"RUTLER Sébastien"},null,null,null,null,null,null,null,null,null,null,{"$f":"IF(N410<>\"\",VLOOKUP(N410,Liste!$C$17:$I$24,3,FALSE),\"\")","v":"PLET Victorien"},null,null,null,null,null,null,null,null,null,null,null,{"$f":"IF(Z410<>\"\",VLOOKUP(Z410,Liste!$C$30:$I$37,3,FALSE),\"\")","v":"PAPIRER Alan"},null,null,null,null,null,null,null,null,null,null,{"$f":"IF(AK410<>\"\",VLOOKUP(AK410,Liste!$C$30:$I$37,3,FALSE),\"\")","v":"ADJAL Yorick"}]
[null,null,{"$f":"IF(C410<>\"\",VLOOKUP(C410,Liste!$C$17:$I$24,7,FALSE),\"\")","v":"PPN NEUVILLE EN FERRAIN"},null,null,null,null,null,null,null,null,null,null,{"$f":"IF(N410<>\"\",VLOOKUP(N410,Liste!$C$17:$I$24,7,FALSE),\"\")","v":"US SAINT BERTHEVIN/SAINT LOUP"},null,null,null,null,null,null,null,null,null,null,null,{"$f":"IF(Z410<>\"\",VLOOKUP(Z410,Liste!$C$30:$I$37,7,FALSE),\"\")","v":"MOULINS LES METZ HANDISPORT"},null,null,null,null,null,null,null,null,null,null,{"$f":"IF(AK410<>\"\",VLOOKUP(AK410,Liste!$C$30:$I$37,7,FALSE),\"\")","v":"A. VOISINS TT"}]
[]
[null,null,null,"contre",null,null,null,null,null,null,null,null,null,null,"contre",null,null,null,null,null,null,null,null,null,null,null,"contre",null,null,null,null,null,null,null,null,null,null,"contre"]
[null,null,{"$f":"IF(D409<>\"\",'GROUPE A'!$K$17,\"\")","v":2},null,null," ",null,null,null,null,null,null,null,{"$f":"IF(O409<>\"\",'GROUPE A'!$K$23,\"\")","v":8},null,null," ",null,null,null,null,null,null,null,null,{"$f":"IF(AA409<>\"\",'GROUPE B'!$K$17,\"\")","v":16},null,null," ",null,null,null,null,null,null,null,{"$f":"IF(AL409<>\"\",'GROUPE B'!$K$23,\"\")","v":10},null,null," "]
[null,null,{"$f":"IF(C415<>\"\",VLOOKUP(C415,Liste!$C$17:$I$24,3,FALSE),\"\")","v":"LE MOAL Bruno"},null,null,null,null,null,null,null,null,null,null,{"$f":"IF(N415<>\"\",VLOOKUP(N415,Liste!$C$17:$I$24,3,FALSE),\"\")","v":"GOLLNISCH Laurent"},null,null,null,null,null,null,null,null,null,null,null,{"$f":"IF(Z415<>\"\",VLOOKUP(Z415,Liste!$C$30:$I$37,3,FALSE),\"\")","v":"HENOUX Frédéric"},null,null,null,null,null,null,null,null,null,null,{"$f":"IF(AK415<>\"\",VLOOKUP(AK415,Liste!$C$30:$I$37,3,FALSE),\"\")","v":"HASLE Stéphane"}]
[null,null,{"$f":"IF(C415<>\"\",VLOOKUP(C415,Liste!$C$17:$I$24,7,FALSE),\"\")","v":"F.O.L.C.L.O."},null,null,null,null,null,null,null,null,null,null,{"$f":"IF(N415<>\"\",VLOOKUP(N415,Liste!$C$17:$I$24,7,FALSE),\"\")","v":"MOULINS LES METZ HANDISPORT"},null,null,null,null,null,null,null,null,null,null,null,{"$f":"IF(Z415<>\"\",VLOOKUP(Z415,Liste!$C$30:$I$37,7,FALSE),\"\")","v":"CTT CHATEAU THIERRY"},null,null,null,null,null,null,null,null,null,null,{"$f":"IF(AK415<>\"\",VLOOKUP(AK415,Liste!$C$30:$I$37,7,FALSE),\"\")","v":"THORIGNE-FOUILLARD TT"}]
[]
[]
[]
[null,null,"CARTONS",null,null,"J","J+R 1","J+R 2",null,null,null,null,null,"CARTONS",null,null,"J","J+R 1","J+R 2",null,null,null,null,null,null,"CARTONS",null,null,"J","J+R 1","J+R 2",null,null,null,null,null,"CARTONS",null,null,"J","J+R 1","J+R 2"]
[null,null,{"$f":"C411","v":"RUTLER Sébastien"},null,null,null,null,null,null,null,null,null,null,{"$f":"N411","v":"PLET Victorien"},null,null,null,null,null,null,null,null,null,null,null,{"$f":"Z411","v":"PAPIRER Alan"},null,null,null,null,null,null,null,null,null,null,{"$f":"AK411","v":"ADJAL Yorick"}]
[]
[null,null,{"$f":"C416","v":"LE MOAL Bruno"},null,null,null,null,null,null,null,null,null,null,{"$f":"N416","v":"GOLLNISCH Laurent"},null,null,null,null,null,null,null,null,null,null,null,{"$f":"Z416","v":"HENOUX Frédéric"},null,null,null,null,null,null,null,null,null,null,{"$f":"AK416","v":"HASLE Stéphane"}]
[]
[null,null,"Signature de l' Arbitre :",null,null,null,null,null,null,null,null,null,null,"Signature de l' Arbitre :",null,null,null,null,null,null,null,null,null,null,null,"Signature de l' Arbitre :",null,null,null,null,null,null,null,null,null,null,"Signature de l' Arbitre :"]
[]
[null,null,"Sitôt la partie terminée ; rapporter cette fiche à la table du Juge Arbitre;",null,null,null,null,null,null,null,null,null,null,"Sitôt la partie terminée ; rapporter cette fiche à la table du Juge Arbitre;",null,null,null,null,null,null,null,null,null,null,null,"Sitôt la partie terminée ; rapporter cette fiche à la table du Juge Arbitre;",null,null,null,null,null,null,null,null,null,null,"Sitôt la partie terminée ; rapporter cette fiche à la table du Juge Arbitre;"]
[]
[]
[null,null,{"$f":"IF(Prépa!$O$10<>0,Prépa!$O$10,\"\")","v":"Critérium Fédéral"},null,null,null,null,null,null,null,null,null,null,{"$f":"IF(Prépa!$O$10<>0,Prépa!$O$10,\"\")","v":"Critérium Fédéral"},null,null,null,null,null,null,null,null,null,null,null,{"$f":"IF(Prépa!$O$10<>0,Prépa!$O$10,\"\")","v":"Critérium Fédéral"},null,null,null,null,null,null,null,null,null,null,{"$f":"IF(Prépa!$O$10<>0,Prépa!$O$10,\"\")","v":"Critérium Fédéral"}]
[null,null,{"$f":"IF(Prépa!$D$14<>0,Prépa!$D$14,\"\")&IF(Prépa!$K$110<>0,\" - \"&Prépa!$K$110,\"\")","v":"TOURS - 10 Fevrier 2018"},null,null,null,null,null,null,null,null,null,null,{"$f":"IF(Prépa!$D$14<>0,Prépa!$D$14,\"\")&IF(Prépa!$K$110<>0,\" - \"&Prépa!$K$110,\"\")","v":"TOURS - 10 Fevrier 2018"},null,null,null,null,null,null,null,null,null,null,null,{"$f":"IF(Prépa!$D$14<>0,Prépa!$D$14,\"\")&IF(Prépa!$K$110<>0,\" - \"&Prépa!$K$110,\"\")","v":"TOURS - 10 Fevrier 2018"},null,null,null,null,null,null,null,null,null,null,{"$f":"IF(Prépa!$D$14<>0,Prépa!$D$14,\"\")&IF(Prépa!$K$110<>0,\" - \"&Prépa!$K$110,\"\")","v":"TOURS - 10 Fevrier 2018"}]
[]
[null,null,{"$f":"IF(Prépa!$O$72<>\"\",Prépa!$O$72,\"\")&IF(Prépa!$O$29<>\"\",\" - \"&Prépa!$O$29,\"\")","v":"OPEN Assis - Nat 2A Nord"},null,null,null,null,null,null,null,null,null,null,{"$f":"IF(Prépa!$O$72<>\"\",Prépa!$O$72,\"\")&IF(Prépa!$O$29<>\"\",\" - \"&Prépa!$O$29,\"\")","v":"OPEN Assis - Nat 2A Nord"},null,null,null,null,null,null,null,null,null,null,null,{"$f":"IF(Prépa!$O$72<>\"\",Prépa!$O$72,\"\")&IF(Prépa!$O$32<>\"\",\" - \"&Prépa!$O$32,\"\")","v":"OPEN Assis - Nat 2B Nord"},null,null,null,null,null,null,null,null,null,null,{"$f":"IF(Prépa!$O$72<>\"\",Prépa!$O$72,\"\")&IF(Prépa!$O$32<>\"\",\" - \"&Prépa!$O$32,\"\")","v":"OPEN Assis - Nat 2B Nord"}]
[]
[null,null,null,null,"Heure :",{"$f":"IF(Prépa!$W$50<>\"\",Prépa!$W$50,\"\")","v":"16h30"},null,null,"Table :",{"$f":"IF(Prépa!$X$50<>\"\",Prépa!$X$50,\"\")","v":3},null,null,null,null,null,"Heure :",{"$f":"IF(Prépa!$W$51<>\"\",Prépa!$W$51,\"\")","v":"16h30"},null,null,"Table :",{"$f":"IF(Prépa!$X$51<>\"\",Prépa!$X$51,\"\")","v":4},null,null,null,null,null,null,"Heure :",{"$f":"IF(Prépa!$AD$50<>\"\",Prépa!$AD$50,\"\")","v":"16h30"},null,null,"Table :",{"$f":"IF(Prépa!$AE$50<>\"\",Prépa!$AE$50,\"\")","v":6},null,null,null,null,null,"Heure :",{"$f":"IF(Prépa!$AD$51<>\"\",Prépa!$AD$51,\"\")","v":"16h30"},null,null,"Table :",{"$f":"IF(Prépa!$AE$51<>\"\",Prépa!$AE$51,\"\")","v":5}]
[]
[null,null,"Arbitre : ",null,null,null,null,null,null,null,null,null,null,"Arbitre : ",null,null,null,null,null,null,null,null,null,null,null,"Arbitre : ",null,null,null,null,null,null,null,null,null,null,"Arbitre : "]
[null,null,null,null,null,null,"27ème Partie",null,null,null,null,null,null,null,null,null,null,"28ème Partie",null,null,null,null,null,null,null,null,null,null,null,"27ème Partie",null,null,null,null,null,null,null,null,null,null,"28ème Partie"]
[null,null,null,null,null,"MANCHES",null,null,null,null,null,null,null,null,null,null,"MANCHES",null,null,null,null,null,null,null,null,null,null,null,"MANCHES",null,null,null,null,null,null,null,null,null,null,"MANCHES"]
[null,null,"PARTIE",null,null,1,2,3,4,5,6,7,null,"PARTIE",null,null,1,2,3,4,5,6,7,null,null,"PARTIE",null,null,1,2,3,4,5,6,7,null,"PARTIE",null,null,1,2,3,4,5,6,7]
[null,null,null,{"$f":"IF(AND('GROUPE A'!$C$53<>\"\",'GROUPE A'!$E$53<>\"\"),'GROUPE A'!$C$53&\" - \"&'GROUPE A'!$E$53,\"\")","v":"4 - 7"},null,"Premier service : GAUCHE - DROITE",null,null,null,null,null,null,null,null,{"$f":"IF(AND('GROUPE A'!$C$54<>\"\",'GROUPE A'!$E$54<>\"\"),'GROUPE A'!$C$54&\" - \"&'GROUPE A'!$E$54,\"\")","v":"5 - 6"},null,"Premier service : GAUCHE - DROITE",null,null,null,null,null,null,null,null,null,{"$f":"IF(AND('GROUPE B'!$C$53<>\"\",'GROUPE B'!$E$53<>\"\"),'GROUPE B'!$C$53&\" - \"&'GROUPE B'!$E$53,\"\")","v":"4 - 7"},null,"Premier service : GAUCHE - DROITE",null,null,null,null,null,null,null,null,{"$f":"IF(AND('GROUPE B'!$C$54<>\"\",'GROUPE B'!$E$54<>\"\"),'GROUPE B'!$C$54&\" - \"&'GROUPE B'!$E$54,\"\")","v":"5 - 6"},null,"Premier service : GAUCHE - DROITE"]
[null,null,{"$f":"IF(D442<>\"\",'GROUPE A'!$K$19,\"\")","v":4},null,null,null,null,null,null,null,null,null,null,{"$f":"IF(O442<>\"\",'GROUPE A'!$K$20,\"\")","v":5},null,null,null,null,null,null,null,null,null,null,null,{"$f":"IF(AA442<>\"\",'GROUPE B'!$K$19,\"\")","v":13},null,null,null,null,null,null,null,null,null,null,{"$f":"IF(AL442<>\"\",'GROUPE B'!$K$20,\"\")","v":14}]
[null,null,{"$f":"IF(C443<>\"\",VLOOKUP(C443,Liste!$C$17:$I$24,3,FALSE),\"\")","v":"DEFRENEIX Samuel"},null,null,null,null,null,null,null,null,null,null,{"$f":"IF(N443<>\"\",VLOOKUP(N443,Liste!$C$17:$I$24,3,FALSE),\"\")","v":"MANIER William"},null,null,null,null,null,null,null,null,null,null,null,{"$f":"IF(Z443<>\"\",VLOOKUP(Z443,Liste!$C$30:$I$37,3,FALSE),\"\")","v":"KERGOSIEN Arnaud"},null,null,null,null,null,null,null,null,null,null,{"$f":"IF(AK443<>\"\",VLOOKUP(AK443,Liste!$C$30:$I$37,3,FALSE),\"\")","v":"BELTRAND Arnaud"}]
[null,null,{"$f":"IF(C443<>\"\",VLOOKUP(C443,Liste!$C$17:$I$24,7,FALSE),\"\")","v":"CTT DEOLS"},null,null,null,null,null,null,null,null,null,null,{"$f":"IF(N443<>\"\",VLOOKUP(N443,Liste!$C$17:$I$24,7,FALSE),\"\")","v":"CGL SUD OISE TT"},null,null,null,null,null,null,null,null,null,null,null,{"$f":"IF(Z443<>\"\",VLOOKUP(Z443,Liste!$C$30:$I$37,7,FALSE),\"\")","v":"F.O.L.C.L.O."},null,null,null,null,null,null,null,null,null,null,{"$f":"IF(AK443<>\"\",VLOOKUP(AK443,Liste!$C$30:$I$37,7,FALSE),\"\")","v":"TT JOUE LES TOURS"}]
[]
[null,null,null,"contre",null,null,null,null,null,null,null,null,null,null,"contre",null,null,null,null,null,null,null,null,null,null,null,"contre",null,null,null,null,null,null,null,null,null,null,"contre"]
[null,null,{"$f":"IF(D442<>\"\",'GROUPE A'!$K$22,\"\")","v":7},null,null," ",null,null,null,null,null,null,null,{"$f":"IF(O442<>\"\",'GROUPE A'!$K$21,\"\")","v":6},null,null," ",null,null,null,null,null,null,null,null,{"$f":"IF(AA442<>\"\",'GROUPE B'!$K$22,\"\")","v":15},null,null," ",null,null,null,null,null,null,null,{"$f":"IF(AL442<>\"\",'GROUPE B'!$K$21,\"\")","v":12},null,null," "]
[null,null,{"$f":"IF(C448<>\"\",VLOOKUP(C448,Liste!$C$17:$I$24,3,FALSE),\"\")","v":"FILLOU Marie-Christine"},null,null,null,null,null,null,null,null,null,null,{"$f":"IF(N448<>\"\",VLOOKUP(N448,Liste!$C$17:$I$24,3,FALSE),\"\")","v":"PIERROT Tristan"},null,null,null,null,null,null,null,null,null,null,null,{"$f":"IF(Z448<>\"\",VLOOKUP(Z448,Liste!$C$30:$I$37,3,FALSE),\"\")","v":"DUBOIS Gilles"},null,null,null,null,null,null,null,null,null,null,{"$f":"IF(AK448<>\"\",VLOOKUP(AK448,Liste!$C$30:$I$37,3,FALSE),\"\")","v":"SIREAU GOSSIAUX Florence"}]
[null,null,{"$f":"IF(C448<>\"\",VLOOKUP(C448,Liste!$C$17:$I$24,7,FALSE),\"\")","v":"SAINT-AVERTIN STT"},null,null,null,null,null,null,null,null,null,null,{"$f":"IF(N448<>\"\",VLOOKUP(N448,Liste!$C$17:$I$24,7,FALSE),\"\")","v":"TT JOUE LES TOURS"},null,null,null,null,null,null,null,null,null,null,null,{"$f":"IF(Z448<>\"\",VLOOKUP(Z448,Liste!$C$30:$I$37,7,FALSE),\"\")","v":"LE MANS SARTHE TT"},null,null,null,null,null,null,null,null,null,null,{"$f":"IF(AK448<>\"\",VLOOKUP(AK448,Liste!$C$30:$I$37,7,FALSE),\"\")","v":"A. VOISINS TT"}]
[]
[]
[]
[null,null,"CARTONS",null,null,"J","J+R 1","J+R 2",null,null,null,null,null,"CARTONS",null,null,"J","J+R 1","J+R 2",null,null,null,null,null,null,"CARTONS",null,null,"J","J+R 1","J+R 2",null,null,null,null,null,"CARTONS",null,null,"J","J+R 1","J+R 2"]
[null,null,{"$f":"C444","v":"DEFRENEIX Samuel"},null,null,null,null,null,null,null,null,null,null,{"$f":"N444","v":"MANIER William"},null,null,null,null,null,null,null,null,null,null,null,{"$f":"Z444","v":"KERGOSIEN Arnaud"},null,null,null,null,null,null,null,null,null,null,{"$f":"AK444","v":"BELTRAND Arnaud"}]
[]
[null,null,{"$f":"C449","v":"FILLOU Marie-Christine"},null,null,null,null,null,null,null,null,null,null,{"$f":"N449","v":"PIERROT Tristan"},null,null,null,null,null,null,null,null,null,null,null,{"$f":"Z449","v":"DUBOIS Gilles"},null,null,null,null,null,null,null,null,null,null,{"$f":"AK449","v":"SIREAU GOSSIAUX Florence"}]
[]
[null,null,"Signature de l' Arbitre :",null,null,null,null,null,null,null,null,null,null,"Signature de l' Arbitre :",null,null,null,null,null,null,null,null,null,null,null,"Signature de l' Arbitre :",null,null,null,null,null,null,null,null,null,null,"Signature de l' Arbitre :"]
[]
[null,null,"Sitôt la partie terminée ; rapporter cette fiche à la table du Juge Arbitre;",null,null,null,null,null,null,null,null,null,null,"Sitôt la partie terminée ; rapporter cette fiche à la table du Juge Arbitre;",null,null,null,null,null,null,null,null,null,null,null,"Sitôt la partie terminée ; rapporter cette fiche à la table du Juge Arbitre;",null,null,null,null,null,null,null,null,null,null,"Sitôt la partie terminée ; rapporter cette fiche à la table du Juge Arbitre;"]